Prosíme přihlašte se nebo zaregistrujte.

Přihlašte se svým uživatelským jménem a heslem.
Placená komunitní podpora

Novinky: Děkujeme všem návštěvníkům fóra, kteří ochotně radí ostatním. Vaše práce je velmi potřebná a vážíme si jí.

Autor Téma: problem s rozpoznanim : webkamera Genius iLook 300 [vyřešeno]  (Přečteno 4355 krát)

jvr23

  • Návštěvník
  • *
  • Příspěvků: 15
  • Karma: +1/-0
    • Zobrazit profil
Cus,

Potreboval bych poradit s vyse uvedenym typem kamery, lsusb ji rozpozna, ale nikde jsem nenasel tento presny typ kamery a tim padem ani ovladac ktery pouzit, nicmene predpokladam ze to bude gspcav1, pac jsem nasel hodne podobnou kameru od Pixartu a u te se pouzival stejny ovladac. Cheese a vsechno ostatni ji vubec nerozpoznavaji ani po instalaci ovladace.  Tady prikladam lsusb a par radku z instalace gspca


jvr23@jvr23:/$ lsusb
Bus 005 Device 005: ID 0bda:8187 Realtek Semiconductor Corp. RTL8187 Wireless Adapter
Bus 005 Device 004: ID 05e3:0606 Genesys Logic, Inc. USB 2.0 Hub / D-Link DUB-H4 USB 2.0 Hub
Bus 005 Device 001: ID 1d6b:0002 Linux Foundation 2.0 root hub
Bus 004 Device 001: ID 1d6b:0001 Linux Foundation 1.1 root hub
Bus 003 Device 004: ID 093a:2628 Pixart Imaging, Inc.
Bus 003 Device 001: ID 1d6b:0001 Linux Foundation 1.1 root hub
Bus 002 Device 003: ID 045e:0040 Microsoft Corp. Wheel Mouse Optical
Bus 002 Device 001: ID 1d6b:0001 Linux Foundation 1.1 root hub
Bus 001 Device 001: ID 1d6b:0001 Linux Foundation 1.1 root hub

A tady mi to hlasa nejake chyby pri instalaci

jvr23@jvr23:/$ sudo m-a prepare
[sudo] password for jvr23:
Stahuji zdrojové texty jádra verze: 2.6.27-11-generic
Hlavičkové soubory jádra dostupné v /usr/src/linux
Vytvářím symbolický odkaz...
Nelze vytvořit symbolický odkaz /usr/src/linux!
apt-get install build-essential
E: Nemohu získat zámek /var/lib/dpkg/lock - open (11 Resource temporarily unavailable)
E: Unable to lock the administration directory (/var/lib/dpkg/), is another process using it?

Hotovo!
jvr23@jvr23:/$

Dalsi prikaz u instalace je  $ m-a a-i gspca,

pote kdyz si dam zobrazit vypis zaznamu tak vypada asi takto :

ke konci je hromada chyb...hruza  :-\
                   

                    dh_testdir                                                                 ↑
 
                 │ dh_testroot                                                                ▮
                 │ dh_clean                                                                   ▒
                 │ /usr/bin/make -C /usr/src/modules/gspca clean                              ▒
                 │ make[1]: Entering directory `/usr/src/modules/gspca'                       ▒
                 │ rm -r -f *.o decoder/.gspcadecoder.o.cmd decoder/*.o \                     ▒
                 │         .gspca.o.cmd  *.o *.ko *.mod.* .[a-z]* core *.i \                  ▒
                 │         *.symvers *.err                                                    ▒
                 │ make[1]: Leaving directory `/usr/src/modules/gspca'                        ▒
                 │ /usr/bin/make  -f debian/rules kdist_clean kdist_config binary-modules     ▒
                 │ make[1]: Entering directory `/usr/src/modules/gspca'                       ▒
                 │ dh_testdir                                                                 ▒
                 │ dh_testroot                                                                ▒
                 │ dh_clean                                                                   ▒
                 │ /usr/bin/make -C /usr/src/modules/gspca clean
                    make[2]: Entering directory `/usr/src/modules/gspca'                       ↑
                 │ rm -r -f *.o decoder/.gspcadecoder.o.cmd decoder/*.o \                     ▒
                 │         .gspca.o.cmd  *.o *.ko *.mod.* .[a-z]* core *.i \                  ▒
                 │         *.symvers *.err                                                    ▒
                 │ make[2]: Leaving directory `/usr/src/modules/gspca'                        ▮
                 │ for templ in ; do \                                                        ▒
                 │     cp $templ `echo $templ | sed -e 's/_KVERS_/2.6.27-11-generic/g'` ; \   ▒
                 │   done                                                                     ▒
                 │ for templ in `ls debian/*.modules.in` ; do \                               ▒
                 │     test -e ${templ%.modules.in}.backup || cp ${templ%.modules.in}         ▒
                 │ ${templ%.modules.in}.backup 2>/dev/null || true; \                         ▒
                 │     sed -e 's/##KVERS##/2.6.27-11-generic/g                                ▒
                 │ ;s/#KVERS#/2.6.27-11-generic/g ; s/_KVERS_/2.6.27-11-generic/g ;           ▒
                 │ s/##KDREV##/2.6.27-11.27/g ; s/#KDREV#/2.6.27-11.27/g ;                    ▒
                 │ s/_KDREV_/2.6.27-11.27/g  ' < $templ > ${templ%.modules.in}; \
│   done                                                                     ↑
                 │ dh_testdir                                                                 ▒
                 │ dh_testroot                                                                ▒
                 │ dh_clean -k                                                                ▒
                 │ # Build the module                                                         ▒
                 │ /usr/bin/make -C /usr/src/modules/gspca KERNEL_VERSION=2.6.27-11-generic   ▒
                 │ KERNELDIR=/usr/src/linux                                                   ▒
                 │ make[2]: Entering directory `/usr/src/modules/gspca'                       ▮
                 │ /usr/bin/make -C /usr/src/linux SUBDIRS=/usr/src/modules/gspca CC=gcc      ▒
                 │ modules                                                                    ▒
                 │ make[3]: Entering directory `/usr/src/linux-headers-2.6.27-11-generic'     ▒
                 │   CC [M]  /usr/src/modules/gspca/gspca_core.o                              ▒
                 │ /usr/src/modules/gspca/gspca_core.c:54:27: error: asm/semaphore.h: No      ▒
                 │ such file or directory                                                     ▒
                 │ /usr/src/modules/gspca/gspca_core.c: In function ‘spca5xx_ioctl’:
 specified in initializer                                                   ↑
                 │ /usr/src/modules/gspca/gspca_core.c:2609: warning: initialization from     ▒
                 │ incompatible pointer type                                                  ▒
                 │ /usr/src/modules/gspca/gspca_core.c:2611: error: unknown field ‘type’      ▒
                 │ specified in initializer                                                   ▒
                 │ /usr/src/modules/gspca/gspca_core.c: In function ‘spca50x_create_sysfs’:   ▒
                 │ /usr/src/modules/gspca/gspca_core.c:2769: error: implicit declaration of   ▒
                 │ function ‘video_device_create_file’                                        ▒
                 │ /usr/src/modules/gspca/gspca_core.c:2780: error: implicit declaration of   ▒
                 │ function ‘video_device_remove_file’                                        ▒
                 │ /usr/src/modules/gspca/gspca_core.c: In function ‘spca5xx_probe’:          ▒
                 │ /usr/src/modules/gspca/gspca_core.c:4301: error: incompatible types in     ▮
                 │ assignment                                                                 ▒
                 │ make[4]: *** [/usr/src/modules/gspca/gspca_core.o] Error 1                 ▒
                 │ make[3]: *** [_module_/usr/src/modules/gspca] Error 2
                    make[3]: Leaving directory `/usr/src/linux-headers-2.6.27-11-generic'      ▒
                 │ make[2]: *** [default] Error 2                                             ▒
                 │ make[2]: Leaving directory `/usr/src/modules/gspca'                        ▒
                 │ make[1]: *** [binary-modules] Error 2                                      ▒
                 │ make[1]: Leaving directory `/usr/src/modules/gspca'                        ▮
                 │ make: *** [kdist_build] Error 2                                            ↓
                 │                                                                             
                 │                                   <Ok>


Nevite nekdo what and where went something wrong?

Dik za odpovedi




« Poslední změna: 04 Březen 2009, 04:08:06 od kiklhorn »

petertomasy

  • Stálý člen
  • ***
  • Příspěvků: 632
  • Karma: +74/-6
    • Zobrazit profil
Re: problem s rozpoznanim : webkamera Genius iLook 300
« Odpověď #1 kdy: 03 Březen 2009, 08:52:14 »
Tu je niečo http://www.linux.org.ru/view-message.jsp?msgid=3290795 ,  čo ti asi pomôže, je to síce  po rusky, ale nevidím v tom až tak veľký problém... ;D . Prelož si to  napr. googlom, je to takmer dokonalé.

jvr23

  • Návštěvník
  • *
  • Příspěvků: 15
  • Karma: +1/-0
    • Zobrazit profil
Re: problem s rozpoznanim : webkamera Genius iLook 300
« Odpověď #2 kdy: 03 Březen 2009, 19:54:04 »
Dik,
moc to nechapu... Nemohl by mi nekdo vysvetlit kroky 2,3,4,5? Mam linux cca 4 dny tak se teprv seznamuju...

arrange

  • Závislák
  • ****
  • Příspěvků: 4043
  • Karma: +472/-15
  • "jdu s hlavou vztyčenou..."
    • Zobrazit profil
Re: problem s rozpoznanim : webkamera Genius iLook 300
« Odpověď #3 kdy: 03 Březen 2009, 20:34:01 »
Zkus vysunout kameru a postupně zadat do Terminálu tyto příkazy. Pokud to hodí chybu, zkopíruj ji sem do fóra.
Kód: [Vybrat]
sudo -i
apt-get install libv4l-0
apt-get install build-essential
cd /tmp
wget http://linuxtv.org/hg/~jfrancois/gspca/archive/tip.tar.gz
tar xvzf tip.tar.gz
sed -i 's:{USB_DEVICE(0x093a, 0x262c), .driver_info = SENSOR_PAC7302},:{USB_DEVICE(0x093a, 0x262c), .driver_info = SENSOR_PAC7302},\n{USB_DEVICE(0x093a, 0x2628), .driver_info = SENSOR_PAC7302},:' gspca-e550fdd396e3/linux/drivers/media/video/gspca/pac7311.c
make
make install

Pokud bez chyby, zkus zapojit kameru a dej sem výpis z dmesg | tail -n20
http://www.openstreetmap.org - mapy celého světa "wiki style"

jvr23

  • Návštěvník
  • *
  • Příspěvků: 15
  • Karma: +1/-0
    • Zobrazit profil
Re: problem s rozpoznanim : webkamera Genius iLook 300
« Odpověď #4 kdy: 03 Březen 2009, 21:12:43 »
Jo takhle se prihlasuje na roota z terminalu  :)

Tento balik je ale podle synapticu naistalovany

root@jvr23:/# apt-get install libv4l-0
E: Nemohu získat zámek /var/lib/dpkg/lock - open (11 Resource temporarily unavailable)
E: Unable to lock the administration directory (/var/lib/dpkg/), is another process using it?
root@jvr23:/#

Tento balik nevim jak zjistim jestli uz ho mam nebo ne

root@jvr23:/# apt-get install build-essential
E: Nemohu získat zámek /var/lib/dpkg/lock - open (11 Resource temporarily unavailable)
E: Unable to lock the administration directory (/var/lib/dpkg/), is another process using it?
root@jvr23:/#

Stahnuti a rozbaleni taru do /tmp probehlo normalne

Prikaz sed, asi taky normalne

root@jvr23:/# sed -i 's:{USB_DEVICE(0x093a, 0x262c), .driver_info = SENSOR_PAC7302},:{USB_DEVICE(0x093a, 0x262c), .driver_info = SENSOR_PAC7302},\n{USB_DEVICE(0x093a, 0x2628), .driver_info = SENSOR_PAC7302},:' /tmp/gspca-e550fdd396e3/linux/drivers/media/video/gspca/pac7311.c
root@jvr23:/#

Make a make install , jestli jsem to dobre pochopil mam spustil v adresari kde je ten ovladac

root@jvr23:/tmp/gspca-e550fdd396e3/linux/drivers/media/video/gspca# make
make: *** No targets.  Stop.
root@jvr23:/tmp/gspca-e550fdd396e3/linux/drivers/media/video/gspca# make install
make: *** No rule to make target `install'.  Stop.
root@jvr23:/tmp/gspca-e550fdd396e3/linux/drivers/media/video/gspca#

Takze tak. Na co je to "sed" "make" a "make install" ?

arrange

  • Závislák
  • ****
  • Příspěvků: 4043
  • Karma: +472/-15
  • "jdu s hlavou vztyčenou..."
    • Zobrazit profil
Re: problem s rozpoznanim : webkamera Genius iLook 300
« Odpověď #5 kdy: 03 Březen 2009, 21:45:08 »
Musíš začít odznova, hned ta první instalace se nepovedla. Pro nápravu zkus některý z těchto kroků:
- restartovat
- v Terminálu killall apt-get nebo sudo rm /var/lib/dpkg/lock

Pak znovu od bodu začátku. Instalace těch balíků nesmí dát chybu, jinak nemá cenu pokračovat.
Jo, a ještě oprava, po tom sedu dej ještě cd gspca-e550fdd396e3, abys byl prostě v adresáři, kde je soubor makefile.

Jak se kompiluje je na wiki i ve fóru, hledej.
http://www.openstreetmap.org - mapy celého světa "wiki style"

jvr23

  • Návštěvník
  • *
  • Příspěvků: 15
  • Karma: +1/-0
    • Zobrazit profil
Re: problem s rozpoznanim : webkamera Genius iLook 300
« Odpověď #6 kdy: 03 Březen 2009, 22:34:26 »
Takze problem s apt-get vyresen smazanim adresare lock, baliky uz byly naistalovane oba pred tim.

Kamera funguje.

Dejvinko

  • Návštěvník
  • *
  • Příspěvků: 5
  • Karma: +0/-0
    • Zobrazit profil
Re: problem s rozpoznanim : webkamera Genius iLook 300 [vyřešeno]
« Odpověď #7 kdy: 03 Červen 2009, 13:01:34 »
Zdravim, resim stejny problem.. postupovla sem podle anvodu ale pri prikazu sed mi napise error:

root@Dejvinko:/tmp# sed -i 's:{USB_DEVICE(0x093a, 0x262c), .driver_info = SENSOR_PAC7302},:{USB_DEVICE(0x093a, 0x262c), .driver_info = SENSOR_PAC7302},\n{USB_DEVICE(0x093a, 0x2628), .driver_info = SENSOR_PAC7302},:' /tmp/gspca-e550fdd396e3/linux/drivers/media/video/gspca/pac7311.c
sed: /tmp/gspca-e550fdd396e3/linux/drivers/media/video/gspca/pac7311.c nelze číst: No such file or directory
root@Dejvinko:/tmp#

Nevite prosim proc se to stalo ?

kovarp

  • Návštěvník
  • *
  • Příspěvků: 1
  • Karma: +0/-0
    • Zobrazit profil
Re: problem s rozpoznanim : webkamera Genius iLook 300 [vyřešeno]
« Odpověď #8 kdy: 03 Březen 2010, 20:57:45 »
zdravim mam tutez kameru a compilace mi hlasi tyto errory

  CC [M]  /home/sarrah/Downloads/gspca-d8fafa7d88dc/v4l/et61x251_core.o
/home/sarrah/Downloads/gspca-d8fafa7d88dc/v4l/et61x251_core.c: In function 'et61x251_ioctl_v4l2':
/home/sarrah/Downloads/gspca-d8fafa7d88dc/v4l/et61x251_core.c:2500: warning: the frame size of 1256 bytes is larger than 1024 bytes
  CC [M]  /home/sarrah/Downloads/gspca-d8fafa7d88dc/v4l/et61x251_tas5130d1b.o
  CC [M]  /home/sarrah/Downloads/gspca-d8fafa7d88dc/v4l/firedtv-avc.o
  CC [M]  /home/sarrah/Downloads/gspca-d8fafa7d88dc/v4l/firedtv-ci.o
  CC [M]  /home/sarrah/Downloads/gspca-d8fafa7d88dc/v4l/firedtv-dvb.o
  CC [M]  /home/sarrah/Downloads/gspca-d8fafa7d88dc/v4l/firedtv-fe.o
  CC [M]  /home/sarrah/Downloads/gspca-d8fafa7d88dc/v4l/firedtv-1394.o
/home/sarrah/Downloads/gspca-d8fafa7d88dc/v4l/firedtv-1394.c:21:17: error: dma.h: No such file or directory
/home/sarrah/Downloads/gspca-d8fafa7d88dc/v4l/firedtv-1394.c:22:21: error: csr1212.h: No such file or directory
/home/sarrah/Downloads/gspca-d8fafa7d88dc/v4l/firedtv-1394.c:23:23: error: highlevel.h: No such file or directory
/home/sarrah/Downloads/gspca-d8fafa7d88dc/v4l/firedtv-1394.c:24:19: error: hosts.h: No such file or directory
/home/sarrah/Downloads/gspca-d8fafa7d88dc/v4l/firedtv-1394.c:25:22: error: ieee1394.h: No such file or directory
/home/sarrah/Downloads/gspca-d8fafa7d88dc/v4l/firedtv-1394.c:26:17: error: iso.h: No such file or directory
/home/sarrah/Downloads/gspca-d8fafa7d88dc/v4l/firedtv-1394.c:27:21: error: nodemgr.h: No such file or directory
/home/sarrah/Downloads/gspca-d8fafa7d88dc/v4l/firedtv-1394.c:40: warning: 'struct hpsb_iso' declared inside parameter list
/home/sarrah/Downloads/gspca-d8fafa7d88dc/v4l/firedtv-1394.c:40: warning: its scope is only this definition or declaration, which is probably not what you want
/home/sarrah/Downloads/gspca-d8fafa7d88dc/v4l/firedtv-1394.c: In function 'rawiso_activity_cb':
/home/sarrah/Downloads/gspca-d8fafa7d88dc/v4l/firedtv-1394.c:56: error: dereferencing pointer to incomplete type
/home/sarrah/Downloads/gspca-d8fafa7d88dc/v4l/firedtv-1394.c:57: error: implicit declaration of function 'hpsb_iso_n_ready'
/home/sarrah/Downloads/gspca-d8fafa7d88dc/v4l/firedtv-1394.c:64: error: dereferencing pointer to incomplete type
/home/sarrah/Downloads/gspca-d8fafa7d88dc/v4l/firedtv-1394.c:65: error: implicit declaration of function 'dma_region_i'
/home/sarrah/Downloads/gspca-d8fafa7d88dc/v4l/firedtv-1394.c:65: error: dereferencing pointer to incomplete type
/home/sarrah/Downloads/gspca-d8fafa7d88dc/v4l/firedtv-1394.c:65: error: expected expression before 'unsigned'
/home/sarrah/Downloads/gspca-d8fafa7d88dc/v4l/firedtv-1394.c:66: warning: assignment makes pointer from integer without a cast
/home/sarrah/Downloads/gspca-d8fafa7d88dc/v4l/firedtv-1394.c:67: error: dereferencing pointer to incomplete type
/home/sarrah/Downloads/gspca-d8fafa7d88dc/v4l/firedtv-1394.c:71: error: dereferencing pointer to incomplete type
/home/sarrah/Downloads/gspca-d8fafa7d88dc/v4l/firedtv-1394.c:85: error: implicit declaration of function 'hpsb_iso_recv_release_packets'
/home/sarrah/Downloads/gspca-d8fafa7d88dc/v4l/firedtv-1394.c: In function 'node_of':
/home/sarrah/Downloads/gspca-d8fafa7d88dc/v4l/firedtv-1394.c:90: error: dereferencing pointer to incomplete type
/home/sarrah/Downloads/gspca-d8fafa7d88dc/v4l/firedtv-1394.c:90: warning: type defaults to 'int' in declaration of '__mptr'
/home/sarrah/Downloads/gspca-d8fafa7d88dc/v4l/firedtv-1394.c:90: warning: initialization from incompatible pointer type
/home/sarrah/Downloads/gspca-d8fafa7d88dc/v4l/firedtv-1394.c:90: error: invalid use of undefined type 'struct unit_directory'
/home/sarrah/Downloads/gspca-d8fafa7d88dc/v4l/firedtv-1394.c: In function 'node_lock':
/home/sarrah/Downloads/gspca-d8fafa7d88dc/v4l/firedtv-1394.c:95: error: 'quadlet_t' undeclared (first use in this function)
/home/sarrah/Downloads/gspca-d8fafa7d88dc/v4l/firedtv-1394.c:95: error: (Each undeclared identifier is reported only once
/home/sarrah/Downloads/gspca-d8fafa7d88dc/v4l/firedtv-1394.c:95: error: for each function it appears in.)
/home/sarrah/Downloads/gspca-d8fafa7d88dc/v4l/firedtv-1394.c:95: error: 'd' undeclared (first use in this function)
/home/sarrah/Downloads/gspca-d8fafa7d88dc/v4l/firedtv-1394.c:96: warning: ISO C90 forbids mixed declarations and code
/home/sarrah/Downloads/gspca-d8fafa7d88dc/v4l/firedtv-1394.c:98: error: implicit declaration of function 'hpsb_node_lock'
/home/sarrah/Downloads/gspca-d8fafa7d88dc/v4l/firedtv-1394.c:99: error: 'EXTCODE_COMPARE_SWAP' undeclared (first use in this function)
/home/sarrah/Downloads/gspca-d8fafa7d88dc/v4l/firedtv-1394.c: In function 'node_read':
/home/sarrah/Downloads/gspca-d8fafa7d88dc/v4l/firedtv-1394.c:107: error: implicit declaration of function 'hpsb_node_read'
/home/sarrah/Downloads/gspca-d8fafa7d88dc/v4l/firedtv-1394.c: In function 'node_write':
/home/sarrah/Downloads/gspca-d8fafa7d88dc/v4l/firedtv-1394.c:112: error: implicit declaration of function 'hpsb_node_write'
/home/sarrah/Downloads/gspca-d8fafa7d88dc/v4l/firedtv-1394.c: In function 'start_iso':
/home/sarrah/Downloads/gspca-d8fafa7d88dc/v4l/firedtv-1394.c:123: error: implicit declaration of function 'hpsb_iso_recv_init'
/home/sarrah/Downloads/gspca-d8fafa7d88dc/v4l/firedtv-1394.c:123: error: dereferencing pointer to incomplete type
/home/sarrah/Downloads/gspca-d8fafa7d88dc/v4l/firedtv-1394.c:125: error: 'HPSB_ISO_DMA_DEFAULT' undeclared (first use in this function)
/home/sarrah/Downloads/gspca-d8fafa7d88dc/v4l/firedtv-1394.c:127: warning: assignment makes pointer from integer without a cast
/home/sarrah/Downloads/gspca-d8fafa7d88dc/v4l/firedtv-1394.c:134: error: implicit declaration of function 'hpsb_iso_recv_start'
/home/sarrah/Downloads/gspca-d8fafa7d88dc/v4l/firedtv-1394.c:137: error: implicit declaration of function 'hpsb_iso_shutdown'
/home/sarrah/Downloads/gspca-d8fafa7d88dc/v4l/firedtv-1394.c: In function 'stop_iso':
/home/sarrah/Downloads/gspca-d8fafa7d88dc/v4l/firedtv-1394.c:148: error: implicit declaration of function 'hpsb_iso_stop'
/home/sarrah/Downloads/gspca-d8fafa7d88dc/v4l/firedtv-1394.c: At top level:
/home/sarrah/Downloads/gspca-d8fafa7d88dc/v4l/firedtv-1394.c:163: warning: 'struct hpsb_host' declared inside parameter list
/home/sarrah/Downloads/gspca-d8fafa7d88dc/v4l/firedtv-1394.c: In function 'fcp_request':
/home/sarrah/Downloads/gspca-d8fafa7d88dc/v4l/firedtv-1394.c:176: error: dereferencing pointer to incomplete type
/home/sarrah/Downloads/gspca-d8fafa7d88dc/v4l/firedtv-1394.c:177: error: dereferencing pointer to incomplete type
/home/sarrah/Downloads/gspca-d8fafa7d88dc/v4l/firedtv-1394.c: In function 'node_probe':
/home/sarrah/Downloads/gspca-d8fafa7d88dc/v4l/firedtv-1394.c:191: error: dereferencing pointer to incomplete type
/home/sarrah/Downloads/gspca-d8fafa7d88dc/v4l/firedtv-1394.c:191: warning: type defaults to 'int' in declaration of '__mptr'
/home/sarrah/Downloads/gspca-d8fafa7d88dc/v4l/firedtv-1394.c:191: warning: initialization from incompatible pointer type
/home/sarrah/Downloads/gspca-d8fafa7d88dc/v4l/firedtv-1394.c:191: error: invalid use of undefined type 'struct unit_directory'
/home/sarrah/Downloads/gspca-d8fafa7d88dc/v4l/firedtv-1394.c:196: error: dereferencing pointer to incomplete type
/home/sarrah/Downloads/gspca-d8fafa7d88dc/v4l/firedtv-1394.c:197: error: dereferencing pointer to incomplete type
/home/sarrah/Downloads/gspca-d8fafa7d88dc/v4l/firedtv-1394.c:198: error: implicit declaration of function 'CSR1212_TEXTUAL_DESCRIPTOR_LEAF_DATA'
/home/sarrah/Downloads/gspca-d8fafa7d88dc/v4l/firedtv-1394.c:198: error: dereferencing pointer to incomplete type
/home/sarrah/Downloads/gspca-d8fafa7d88dc/v4l/firedtv-1394.c:198: warning: assignment makes pointer from integer without a cast
/home/sarrah/Downloads/gspca-d8fafa7d88dc/v4l/firedtv-1394.c: At top level:
/home/sarrah/Downloads/gspca-d8fafa7d88dc/v4l/firedtv-1394.c:257: warning: 'struct unit_directory' declared inside parameter list
/home/sarrah/Downloads/gspca-d8fafa7d88dc/v4l/firedtv-1394.c: In function 'node_update':
/home/sarrah/Downloads/gspca-d8fafa7d88dc/v4l/firedtv-1394.c:259: error: dereferencing pointer to incomplete type
/home/sarrah/Downloads/gspca-d8fafa7d88dc/v4l/firedtv-1394.c: At top level:
/home/sarrah/Downloads/gspca-d8fafa7d88dc/v4l/firedtv-1394.c:267: error: variable 'fdtv_driver' has initializer but incomplete type
/home/sarrah/Downloads/gspca-d8fafa7d88dc/v4l/firedtv-1394.c:268: error: unknown field 'name' specified in initializer
/home/sarrah/Downloads/gspca-d8fafa7d88dc/v4l/firedtv-1394.c:268: warning: excess elements in struct initializer
/home/sarrah/Downloads/gspca-d8fafa7d88dc/v4l/firedtv-1394.c:268: warning: (near initialization for 'fdtv_driver')
/home/sarrah/Downloads/gspca-d8fafa7d88dc/v4l/firedtv-1394.c:269: error: unknown field 'id_table' specified in initializer
/home/sarrah/Downloads/gspca-d8fafa7d88dc/v4l/firedtv-1394.c:269: warning: excess elements in struct initializer
/home/sarrah/Downloads/gspca-d8fafa7d88dc/v4l/firedtv-1394.c:269: warning: (near initialization for 'fdtv_driver')
/home/sarrah/Downloads/gspca-d8fafa7d88dc/v4l/firedtv-1394.c:270: error: unknown field 'update' specified in initializer
/home/sarrah/Downloads/gspca-d8fafa7d88dc/v4l/firedtv-1394.c:270: warning: excess elements in struct initializer
/home/sarrah/Downloads/gspca-d8fafa7d88dc/v4l/firedtv-1394.c:270: warning: (near initialization for 'fdtv_driver')
/home/sarrah/Downloads/gspca-d8fafa7d88dc/v4l/firedtv-1394.c:271: error: unknown field 'driver' specified in initializer
/home/sarrah/Downloads/gspca-d8fafa7d88dc/v4l/firedtv-1394.c:271: error: extra brace group at end of initializer
/home/sarrah/Downloads/gspca-d8fafa7d88dc/v4l/firedtv-1394.c:271: error: (near initialization for 'fdtv_driver')
/home/sarrah/Downloads/gspca-d8fafa7d88dc/v4l/firedtv-1394.c:274: warning: excess elements in struct initializer
/home/sarrah/Downloads/gspca-d8fafa7d88dc/v4l/firedtv-1394.c:274: warning: (near initialization for 'fdtv_driver')
/home/sarrah/Downloads/gspca-d8fafa7d88dc/v4l/firedtv-1394.c:277: error: variable 'fdtv_highlevel' has initializer but incomplete type
/home/sarrah/Downloads/gspca-d8fafa7d88dc/v4l/firedtv-1394.c:278: error: unknown field 'name' specified in initializer
/home/sarrah/Downloads/gspca-d8fafa7d88dc/v4l/firedtv-1394.c:278: warning: excess elements in struct initializer
/home/sarrah/Downloads/gspca-d8fafa7d88dc/v4l/firedtv-1394.c:278: warning: (near initialization for 'fdtv_highlevel')
/home/sarrah/Downloads/gspca-d8fafa7d88dc/v4l/firedtv-1394.c:279: error: unknown field 'fcp_request' specified in initializer
/home/sarrah/Downloads/gspca-d8fafa7d88dc/v4l/firedtv-1394.c:279: warning: excess elements in struct initializer
/home/sarrah/Downloads/gspca-d8fafa7d88dc/v4l/firedtv-1394.c:279: warning: (near initialization for 'fdtv_highlevel')
/home/sarrah/Downloads/gspca-d8fafa7d88dc/v4l/firedtv-1394.c: In function 'fdtv_1394_init':
/home/sarrah/Downloads/gspca-d8fafa7d88dc/v4l/firedtv-1394.c:286: error: implicit declaration of function 'hpsb_register_highlevel'
/home/sarrah/Downloads/gspca-d8fafa7d88dc/v4l/firedtv-1394.c:287: error: implicit declaration of function 'hpsb_register_protocol'
/home/sarrah/Downloads/gspca-d8fafa7d88dc/v4l/firedtv-1394.c:290: error: implicit declaration of function 'hpsb_unregister_highlevel'
/home/sarrah/Downloads/gspca-d8fafa7d88dc/v4l/firedtv-1394.c: In function 'fdtv_1394_exit':
/home/sarrah/Downloads/gspca-d8fafa7d88dc/v4l/firedtv-1394.c:297: error: implicit declaration of function 'hpsb_unregister_protocol'
make[3]: *** [/home/sarrah/Downloads/gspca-d8fafa7d88dc/v4l/firedtv-1394.o] Error 1
make[2]: *** [_module_/home/sarrah/Downloads/gspca-d8fafa7d88dc/v4l] Error 2
make[2]: Leaving directory `/usr/src/linux-headers-2.6.31-19-generic'
make[1]: *** [default] Error 2
make[1]: Leaving directory `/home/sarrah/Downloads/gspca-d8fafa7d88dc/v4l'
make: *** [all] Error 2
root@Sarrah:/home/sarrah/Downloads/gspca-d8fafa7d88dc#

by nekdo vedel prosim poradte