Prosíme přihlašte se nebo zaregistrujte.

Přihlašte se svým uživatelským jménem a heslem.

Novinky: Děkujeme všem návštěvníkům fóra, kteří ochotně radí ostatním. Vaše práce je velmi potřebná a vážíme si jí.

Zobrazit příspěvky

Tato sekce Vám umožňuje zobrazit všechny příspěvky tohoto uživatele. Prosím uvědomte si, že můžete vidět příspěvky pouze z oblastí Vám přístupných.


Příspěvky - navsteva

Stran: [1] 2 3 ... 9
1
Free Rapid Downloader normálně funguje s default-jre. Aktuálně mám Openjdk-8-jre, předtím 7 a 6. A používám to léta. Oracle javu nikdy neinstaluji.

2
Vyřešeno. Nejedná se o virus. Je to hardwarový problém. Buď vadná myš, náhodně stiskává tlačítka bez interakce uživatele, nebo vadný usb port, nebo jen špatně dotlačený usb kabel. Náhodné stiskávání kolečka myši zřejmě dělá divy. [vyřešeno]

3
Podpora pro pracovní prostředí / Re:Pomoc virus v repozitáři!!
« kdy: 04 Říjen 2017, 04:35:54 »
Vkládá nejen obsah ze schránky, ale i poslední napsané příkazy do terminálu, je tam keylogger

4
Podpora pro pracovní prostředí / Pomoc virus v repozitáři!!
« kdy: 04 Říjen 2017, 04:18:07 »
V repozitáři je virus, je v balíku translate-shell. Odinstalování nepomůže. A to ani apt purge, aptitude purge ~c, apt autoremove.

Nevím, jak se toho zbavit. Náhodně mi vkládá text ze schránky kamkoliv, do terminálu, do prohlížeče, atd. Vytváří plochy...

ubuntu 17.04, je to v repozitáři multiverse

Kód: [Vybrat]
ROOTDIR is `/'
Checking `amd'...                                           not found
Checking `basename'...                                      not infected
Checking `biff'...                                          not found
Checking `chfn'...                                          not infected
Checking `chsh'...                                          not infected
Checking `cron'...                                          not infected
Checking `crontab'...                                       not infected
Checking `date'...                                          not infected
Checking `du'...                                            not infected
Checking `dirname'...                                       not infected
Checking `echo'...                                          not infected
Checking `egrep'...                                         not infected
Checking `env'...                                           not infected
Checking `find'...                                          not infected
Checking `fingerd'...                                       not found
Checking `gpm'...                                           not infected
Checking `grep'...                                          not infected
Checking `hdparm'...                                        not infected
Checking `su'...                                            not infected
Checking `ifconfig'...                                      not infected
Checking `inetd'...                                         not infected
Checking `inetdconf'...                                     not found
Checking `identd'...                                        not found
Checking `init'...                                          not infected
Checking `killall'...                                       not infected
Checking `ldsopreload'...                                   not infected
Checking `login'...                                         not infected
Checking `ls'...                                            not infected
Checking `lsof'...                                          not infected
Checking `mail'...                                          not found
Checking `mingetty'...                                      not found
Checking `netstat'...                                       not infected
Checking `named'...                                         not found
Checking `passwd'...                                        not infected
Checking `pidof'...                                         not infected
Checking `pop2'...                                          not found
Checking `pop3'...                                          not found
Checking `ps'...                                            not infected
Checking `pstree'...                                        not infected
Checking `rpcinfo'...                                       not found
Checking `rlogind'...                                       not found
Checking `rshd'...                                          not found
Checking `slogin'...                                        not infected
Checking `sendmail'...                                      not found
Checking `sshd'...                                          not infected
Checking `syslogd'...                                       not tested
Checking `tar'...                                           not infected
Checking `tcpd'...                                          INFECTED
Checking `tcpdump'...                                       not infected
Checking `top'...                                           not infected
Checking `telnetd'...                                       not found
Checking `timed'...                                         not found
Checking `traceroute'...                                    not found
Checking `vdir'...                                          not infected
Checking `w'...                                             not infected
Checking `write'...                                         not infected
Checking `aliens'...                                        no suspect files
Searching for sniffer's logs, it may take a while...        nothing found
Searching for rootkit HiDrootkit's default files...         nothing found
Searching for rootkit t0rn's default files...               nothing found
Searching for t0rn's v8 defaults...                         nothing found
Searching for rootkit Lion's default files...               nothing found
Searching for rootkit RSHA's default files...               nothing found
Searching for rootkit RH-Sharpe's default files...          nothing found
Searching for Ambient's rootkit (ark) default files and dirs... nothing found
Searching for suspicious files and dirs, it may take a while... The following suspicious files and directories were found: 
/usr/lib/debug/.build-id /usr/lib/python2.7/dist-packages/PyQt4/uic/widget-plugins/.noinit /usr/lib/jvm/.java-1.8.0-openjdk-amd64.jinfo /usr/lib/python3/dist-packages/matplotlib/tests/baseline_images/.keep /lib/modules/4.10.0-35-generic/vdso/.build-id /lib/modules/4.10.0-36-generic/vdso/.build-id
/usr/lib/debug/.build-id /lib/modules/4.10.0-35-generic/vdso/.build-id /lib/modules/4.10.0-36-generic/vdso/.build-id
Searching for LPD Worm files and dirs...                    nothing found
Searching for Ramen Worm files and dirs...                  nothing found
Searching for Maniac files and dirs...                      nothing found
Searching for RK17 files and dirs...                        nothing found
Searching for Ducoci rootkit...                             nothing found
Searching for Adore Worm...                                 nothing found
Searching for ShitC Worm...                                 nothing found
Searching for Omega Worm...                                 nothing found
Searching for Sadmind/IIS Worm...                           nothing found
Searching for MonKit...                                     nothing found
Searching for Showtee...                                    nothing found
Searching for OpticKit...                                   nothing found
Searching for T.R.K...                                      nothing found
Searching for Mithra...                                     nothing found
Searching for LOC rootkit...                                nothing found
Searching for Romanian rootkit...                           nothing found
Searching for Suckit rootkit...                             nothing found
Searching for Volc rootkit...                               nothing found
Searching for Gold2 rootkit...                              nothing found
Searching for TC2 Worm default files and dirs...            nothing found
Searching for Anonoying rootkit default files and dirs...   nothing found
Searching for ZK rootkit default files and dirs...          nothing found
Searching for ShKit rootkit default files and dirs...       nothing found
Searching for AjaKit rootkit default files and dirs...      nothing found
Searching for zaRwT rootkit default files and dirs...       nothing found
Searching for Madalin rootkit default files...              nothing found
Searching for Fu rootkit default files...                   nothing found
Searching for ESRK rootkit default files...                 nothing found
Searching for rootedoor...                                  nothing found
Searching for ENYELKM rootkit default files...              nothing found
Searching for common ssh-scanners default files...          nothing found
Searching for Linux/Ebury - Operation Windigo ssh...        nothing found
Searching for 64-bit Linux Rootkit ...                      nothing found
Searching for 64-bit Linux Rootkit modules...               nothing found
Searching for suspect PHP files...                          nothing found
Searching for anomalies in shell history files...           Warning: `//home/medved/.bashburn_history' file size is zero
Checking `asp'...                                           not infected
Checking `bindshell'...                                     not infected
Checking `lkm'...                                           chkproc: nothing detected
chkdirs: nothing detected
Checking `rexedcs'...                                       not found
Checking `sniffer'...                                       lo: not promisc and no packet sniffer sockets
enp4s0: not promisc and no packet sniffer sockets
Checking `w55808'...                                        not infected
Checking `wted'...                                          chkwtmp: nothing deleted
Checking `scalper'...                                       not infected
Checking `slapper'...                                       not infected
Checking `z2'...                                            chklastlog: nothing deleted
Checking `chkutmp'...                                        The tty of the following user process(es) were not found
 in /var/run/utmp !
! RUID          PID TTY    CMD
! 553;2,4,3553;2,5,3553;2,6,3553;2,7,3553;2,8,3553;2,9,3553;2,10,3553;2,11,3553;2,12,3553;2,13,3553;2,14,3553;2,15,3553;2,16,3553;2,17,3553;3,0,3553;3,1,3553;3,2,3553;3,3,3553;3,4,3553;3,5,3553;3,6,3553;3,7,3553;3,8,3553;3,9,3553;3,10,3553;3,11,3553;3,12,3553;3,13,3553;3,14,3553;3,15,3553;3,16       2 ,3553;1,17,3553;2,0,3553;2,1,3553;553;2,4,3553;2,5,3553;2,6,3553;2,7,3553;2,8,3553;2,9,3553;2,10,3553;2,11,3553;2,12,3553;2,13,3553;2,14,3553;2,15,3553;2,16,3553;2,17,3553;3,0,3553;3,1,3553;3,2,3553;3,3,3553;3,4,3553;3,5,3553;3,6,3553;3,7,3553;3,8,3553;3,9,3553;3,10,3553;3,11,3553;3,12,3553;3,13,3553;3,14,3553;3,15,3553;3,16 ,3553;2,8,3553;2,9,3553;2,10,3553;2,11,3553;2,12,3553;2,13,3553;2,14,3553;2,15,3553;2,16,3553;2,17,3553;3,0,3553;3,1,3553;3,2,3553;3,3,3553;3,4,3553;3,5,3553;3,6,3553;3,7,3553;3,8,3553;3,9,3553;3,10,3553;3,11,3553;3,12,3553;3,13,3553;3,14,3553;3,15,3553;3,16
! ,3553;2,2,3553;2,3,3553;2,4,3553;2,5,3553;2,6,3553;2,7,3553;2,8,3553;2,9,3553;2,10,3553;2,11,3553;2,12,3553;2,13,3553;2,14,3553;2,15,3553;2,16,3553;2,17,3553;3,0,3553;3,1,3553;3,2,3553;3,3,3553;3,4,3553;3,5,3553;3,6,3553;3,7,3553;3,8,3553;3,9,3553;3,10,3553;3,11,3553;3,12,3553;3,13,3553;3,14       3 ,3553;1,15,3553;1,16,3553;1,17,355,3553;2,2,3553;2,3,3553;2,4,3553;2,5,3553;2,6,3553;2,7,3553;2,8,3553;2,9,3553;2,10,3553;2,11,3553;2,12,3553;2,13,3553;2,14,3553;2,15,3553;2,16,3553;2,17,3553;3,0,3553;3,1,3553;3,2,3553;3,3,3553;3,4,3553;3,5,3553;3,6,3553;3,7,3553;3,8,3553;3,9,3553;3,10,3553;3,11,3553;3,12,3553;3,13,3553;3,14 ,5,3553;2,6,3553;2,7,3553;2,8,3553;2,9,3553;2,10,3553;2,11,3553;2,12,3553;2,13,3553;2,14,3553;2,15,3553;2,16,3553;2,17,3553;3,0,3553;3,1,3553;3,2,3553;3,3,3553;3,4,3553;3,5,3553;3,6,3553;3,7,3553;3,8,3553;3,9,3553;3,10,3553;3,11,3553;3,12,3553;3,13,3553;3,14
! ,3553;2,2,3553;2,3,3553;2,4,3553;2,5,3553;2,6,3553;2,7,3553;2,8,3553;2,9,3553;2,10,3553;2,11,3553;2,12,3553;2,13,3553;2,14,3553;2,15,3553;2,16,3553;2,17,3553;3,0,3553;3,1,3553;3,2,3553;3,3,3553;3,4,3553;3,5,3553;3,6,3553;3,7,3553;3,8,3553;3,9,3553;3,10,3553;3,11,3553;3,12,3553;3,13,3553;3,14       3 ,3553;1,15,3553;1,16,3553;1,17,355,3553;2,2,3553;2,3,3553;2,4,3553;2,5,3553;2,6,3553;2,7,3553;2,8,3553;2,9,3553;2,10,3553;2,11,3553;2,12,3553;2,13,3553;2,14,3553;2,15,3553;2,16,3553;2,17,3553;3,0,3553;3,1,3553;3,2,3553;3,3,3553;3,4,3553;3,5,3553;3,6,3553;3,7,3553;3,8,3553;3,9,3553;3,10,3553;3,11,3553;3,12,3553;3,13,3553;3,14 ,5,3553;2,6,3553;2,7,3553;2,8,3553;2,9,3553;2,10,3553;2,11,3553;2,12,3553;2,13,3553;2,14,3553;2,15,3553;2,16,3553;2,17,3553;3,0,3553;3,1,3553;3,2,3553;3,3,3553;3,4,3553;3,5,3553;3,6,3553;3,7,3553;3,8,3553;3,9,3553;3,10,3553;3,11,3553;3,12,3553;3,13,3553;3,14
! ,3553;2,2,3553;2,3,3553;2,4,3553;2,5,3553;2,6,3553;2,7,3553;2,8,3553;2,9,3553;2,10,3553;2,11,3553;2,12,3553;2,13,3553;2,14,3553;2,15,3553;2,16,3553;2,17,3553;3,0,3553;3,1,3553;3,2,3553;3,3,3553;3,4,3553;3,5,3553;3,6,3553;3,7,3553;3,8,3553;3,9,3553;3,10,3553;3,11,3553;3,12,3553;3,13,3553;3,14       3 ,3553;1,15,3553;1,16,3553;1,17,355,3553;2,2,3553;2,3,3553;2,4,3553;2,5,3553;2,6,3553;2,7,3553;2,8,3553;2,9,3553;2,10,3553;2,11,3553;2,12,3553;2,13,3553;2,14,3553;2,15,3553;2,16,3553;2,17,3553;3,0,3553;3,1,3553;3,2,3553;3,3,3553;3,4,3553;3,5,3553;3,6,3553;3,7,3553;3,8,3553;3,9,3553;3,10,3553;3,11,3553;3,12,3553;3,13,3553;3,14 ,5,3553;2,6,3553;2,7,3553;2,8,3553;2,9,3553;2,10,3553;2,11,3553;2,12,3553;2,13,3553;2,14,3553;2,15,3553;2,16,3553;2,17,3553;3,0,3553;3,1,3553;3,2,3553;3,3,3553;3,4,3553;3,5,3553;3,6,3553;3,7,3553;3,8,3553;3,9,3553;3,10,3553;3,11,3553;3,12,3553;3,13,3553;3,14
! ,3553;2,2,3553;2,3,3553;2,4,3553;2,5,3553;2,6,3553;2,7,3553;2,8,3553;2,9,3553;2,10,3553;2,11,3553;2,12,3553;2,13,3553;2,14,3553;2,15,3553;2,16,3553;2,17,3553;3,0,3553;3,1,3553;3,2,3553;3,3,3553;3,4,3553;3,5,3553;3,6,3553;3,7,3553;3,8,3553;3,9,3553;3,10,3553;3,11,3553;3,12,3553;3,13,3553;3,14       3 ,3553;1,15,3553;1,16,3553;1,17,355,3553;2,2,3553;2,3,3553;2,4,3553;2,5,3553;2,6,3553;2,7,3553;2,8,3553;2,9,3553;2,10,3553;2,11,3553;2,12,3553;2,13,3553;2,14,3553;2,15,3553;2,16,3553;2,17,3553;3,0,3553;3,1,3553;3,2,3553;3,3,3553;3,4,3553;3,5,3553;3,6,3553;3,7,3553;3,8,3553;3,9,3553;3,10,3553;3,11,3553;3,12,3553;3,13,3553;3,14 ,5,3553;2,6,3553;2,7,3553;2,8,3553;2,9,3553;2,10,3553;2,11,3553;2,12,3553;2,13,3553;2,14,3553;2,15,3553;2,16,3553;2,17,3553;3,0,3553;3,1,3553;3,2,3553;3,3,3553;3,4,3553;3,5,3553;3,6,3553;3,7,3553;3,8,3553;3,9,3553;3,10,3553;3,11,3553;3,12,3553;3,13,3553;3,14
! ,3553;2,2,3553;2,3,3553;2,4,3553;2,5,3553;2,6,3553;2,7,3553;2,8,3553;2,9,3553;2,10,3553;2,11,3553;2,12,3553;2,13,3553;2,14,3553;2,15,3553;2,16,3553;2,17,3553;3,0,3553;3,1,3553;3,2,3553;3,3,3553;3,4,3553;3,5,3553;3,6,3553;3,7,3553;3,8,3553;3,9,3553;3,10,3553;3,11,3553;3,12,3553;3,13,3553;3,14       3 ,3553;1,15,3553;1,16,3553;1,17,355,3553;2,2,3553;2,3,3553;2,4,3553;2,5,3553;2,6,3553;2,7,3553;2,8,3553;2,9,3553;2,10,3553;2,11,3553;2,12,3553;2,13,3553;2,14,3553;2,15,3553;2,16,3553;2,17,3553;3,0,3553;3,1,3553;3,2,3553;3,3,3553;3,4,3553;3,5,3553;3,6,3553;3,7,3553;3,8,3553;3,9,3553;3,10,3553;3,11,3553;3,12,3553;3,13,3553;3,14 ,5,3553;2,6,3553;2,7,3553;2,8,3553;2,9,3553;2,10,3553;2,11,3553;2,12,3553;2,13,3553;2,14,3553;2,15,3553;2,16,3553;2,17,3553;3,0,3553;3,1,3553;3,2,3553;3,3,3553;3,4,3553;3,5,3553;3,6,3553;3,7,3553;3,8,3553;3,9,3553;3,10,3553;3,11,3553;3,12,3553;3,13,3553;3,14
! 553;2,4,3553;2,5,3553;2,6,3553;2,7,3553;2,8,3553;2,9,3553;2,10,3553;2,11,3553;2,12,3553;2,13,3553;2,14,3553;2,15,3553;2,16,3553;2,17,3553;3,0,3553;3,1,3553;3,2,3553;3,3,3553;3,4,3553;3,5,3553;3,6,3553;3,7,3553;3,8,3553;3,9,3553;3,10,3553;3,11,3553;3,12,3553;3,13,3553;3,14,3553;3,15,3553;3,16       2 ,3553;1,17,3553;2,0,3553;2,1,3553;553;2,4,3553;2,5,3553;2,6,3553;2,7,3553;2,8,3553;2,9,3553;2,10,3553;2,11,3553;2,12,3553;2,13,3553;2,14,3553;2,15,3553;2,16,3553;2,17,3553;3,0,3553;3,1,3553;3,2,3553;3,3,3553;3,4,3553;3,5,3553;3,6,3553;3,7,3553;3,8,3553;3,9,3553;3,10,3553;3,11,3553;3,12,3553;3,13,3553;3,14,3553;3,15,3553;3,16 ,3553;2,8,3553;2,9,3553;2,10,3553;2,11,3553;2,12,3553;2,13,3553;2,14,3553;2,15,3553;2,16,3553;2,17,3553;3,0,3553;3,1,3553;3,2,3553;3,3,3553;3,4,3553;3,5,3553;3,6,3553;3,7,3553;3,8,3553;3,9,3553;3,10,3553;3,11,3553;3,12,3553;3,13,3553;3,14,3553;3,15,3553;3,16
! medved       3502 pts/0  bash
! root        15050 pts/0  /bin/sh /usr/sbin/chkrootkit
! root        15708 pts/0  ./chkutmp
! root        15710 pts/0  ps axk tty,ruser,args -o tty,pid,ruser,args
! root        15709 pts/0  sh -c ps axk "tty,ruser,args" -o "tty,pid,ruser,args"
! root        15049 pts/0  sudo chkrootkit
! medved       3796 pts/1  bash
! root        15027 pts/1  nano /etc/passwd
! root        15026 pts/1  sudo nano /etc/passwd
! medved       3877 pts/2  bash
! medved       3951 pts/2  su
! root         3952 pts/2  bash
chkutmp: nothing deleted
Checking `OSX_RSPLUG'...                                    not infected

5
Mám shodou okolností ten samý NTB a chová se to (U 14.04) naprosto stejně. A nebýt tohoto dotazu, ani bych si toho nevšiml. Na vině bude jak jinak driver touchpadu. Zřejmě ale nezbyde, než ho v případě potřeby vypínat/zapínat softwarově. Vytvoř si na to spouštěč na plochu nebo namapuj kl. zkratku.
------------------------------------
Ještě dodám, že rovněž nešel regulovat jas (byl stále na plno) a bylo to nutno poměrně krkolomně řešit...

Díky, to mne taky napadlo s tou klávesovou zkratkou. Spouštěče jsem si vytvořil a dal je do start menu. Kdyby se to tlačítko dalo aspoň nějak deaktivovat. Mrknu do biosu, jestli tam na to něco není. Regulace jasu mi funguje, v /etc/default/grub mám v parametrech acpi=vendor, nebo tak něco. Než jsem to tam dal, tak jsem měl opačný problém, jas byl asi na 50 % procentech.

6
Ještě dodám, že když se vypne tlačítkem, tak to vyvolá asi jiné vypnutí, než to vypnutí softwarové, protože když se vypne tlačítkem, tak nahodit nejde ani přes xinput --enable a musí se restartovat.

7
Ahoj, snažím se u notebooku acer aspire 5738Z s xubuntu 17.04 rozchodit tuchpad, respektive on funguje, krásně, až do té doby, než uživatel zmáčkne hardwarový vypínač. Jakmile se stiskne hardwarový vypínač, tak se SynPS/2 Synaptics TouchPad vypne a je očekávané chování, že po dalším stisku se zase zapne. Bohužel se ale nezapne.

Pokud vypnu a zapnu softwarově přes:

Kód: [Vybrat]
xinput --disable 12 a
Kód: [Vybrat]
xinput --enable 12, tak se touchpad vypne i zapne. Jak rozchodit ale správně to hardwarové tlačítko, aby dokázalo nejen touchpad vypnout, ale ho i zapnout?

8
Dík, nejspíš by to pomohlo. Povýšil jsem z 16.04  na 17.04 přes kabel a všechny problémy odpadly, jedu na výchozím ovladači a firmwaru bez úprav a  žádné chyby jsem nezaznamenal. Tedy, ne chyby, které by s tím souvisely.

Samozřejmě, že problémy byly. Například že systemd-resolved úplně podělal dns, takže šlo sice pingat na ip adresy, ale neresolvovalo to. Takže vlastně "internet" rovněž nefungoval.

Stačilo:
Kód: [Vybrat]
sudo systemctl disable systemd-resolved.service
sudo service systemd-resolved stop

Přidat řádek do sekce  [main] v souboru /etc/NetworkManager/NetworkManager.conf:

Kód: [Vybrat]
dns=default

Smazat symlink /etc/resolv.conf
Kód: [Vybrat]
rm /etc/resolv.conf
A znovu nahodit networkmanager:
Kód: [Vybrat]
systemctl restart NetworkManager

9
Dokud nevyzkoušíš, nepochopíš, jak je to pohodlné. CTRL+Alt+T, pak napíšu m (mám na to alias, který má v sobě i cestu k hudbě i  mé oblíbené barevné téma, a hned mohu přes šipky vybrat složku, pak stačí jen entr, a hraju. Pomocí <> měním hlasitost, plus tam jsou ještě nějaké zkratky. Ostatní přehrávače jsem úplně přestal používat.

10
Fakt vtipné, že místo hledání řešení padání tazatel chce připojení restartovat = shodit a nahodit a když se mu té vyžádané rady dostane, tak se diví, že teď každých pět minut mu to klekne. Jsou vyloučeny hardware závady? Např. konektor, kabel, router? Pokud nepomůže, tak nahrazovat pouze mrtvé připojení, nežádat o radu, jak restartovat, protože to shodí i funkční.

V bashi můžeme napsat podmínky, vázané na stavy. Můžeme periodicky pvyhodnocovat, jestli jsme připojení. Potak nebudeme určitě chtít restartovat vždy (a zabíjet třeba probíhající download či upload), ale použijeme systémovější řešení.

Mne problémy s ovladači u jedné karty vyřešil přechod na 17.04.

11
Vždyť máš na tom druhém screenu napsané, abys spustil

Kód: [Vybrat]
sudo apt-get install -f

12
Music on Console

Kód: [Vybrat]
sudo apt install moc
Po instalaci stačí spustit v terminálu. Nejlepší přehrávač pro linux, co znám :-)

13
Odinstalace se jak se zdá nezdařila:

Kód: [Vybrat]
dmesg | grep -i rt3290
[   35.032744] ieee80211 phy0: rt2x00lib_request_firmware: Info - Loading firmware file 'rt3290.bin'
[   35.134329] rt2800pci 0000:04:00.0: Direct firmware load for rt3290.bin failed with error -2


15
Problém by neměl být v UEFI,
když secure boot je vypnutý.

Nenašel jsem žádný návod v češtině, jak ten ovladač podepsat.

To to ostatním funguje i bez podpisu?

Jak vrátím původní nový polofunkční ovladač z kernelu?

Odinstalace nepomůže...

16
Kód: [Vybrat]
make
make -C tools
make[1]: Vstupuje se do adresáře „/home/user/Stažené/RT3290/src/tools“
gcc -g bin2h.c -o bin2h
chmod +x bin2h
make[1]: Opouští se adresář „/home/user/Stažené/RT3290/src/tools“
/home/user/Stažené/RT3290/src/tools/bin2h
cp -f os/linux/Makefile.6 /home/user/Stažené/RT3290/src/os/linux/Makefile
make -C /lib/modules/4.4.0-88-generic/build SUBDIRS=/home/user/Stažené/RT3290/src/os/linux modules
make[1]: Vstupuje se do adresáře „/usr/src/linux-headers-4.4.0-88-generic“
  CC [M]  /home/user/Stažené/RT3290/src/os/linux/../../common/crypt_md5.o
  CC [M]  /home/user/Stažené/RT3290/src/os/linux/../../common/crypt_sha2.o
  CC [M]  /home/user/Stažené/RT3290/src/os/linux/../../common/crypt_hmac.o
  CC [M]  /home/user/Stažené/RT3290/src/os/linux/../../common/crypt_aes.o
In file included from /home/user/Stažené/RT3290/src/include/rtmp_os.h:42:0,
                 from /home/user/Stažené/RT3290/src/include/rtmp_comm.h:56,
                 from /home/user/Stažené/RT3290/src/include/rt_config.h:36,
                 from /home/user/Stažené/RT3290/src/include/crypt_aes.h:38,
                 from /home/user/Stažené/RT3290/src/os/linux/../../common/crypt_aes.c:35:
/home/user/Stažené/RT3290/src/os/linux/../../common/crypt_aes.c: In function ‘AES_Key_Wrap’:
/home/user/Stažené/RT3290/src/os/linux/../../common/crypt_aes.c:1466:32: warning: format ‘%d’ expects argument of type ‘int’, but argument 2 has type ‘long unsigned int’ [-Wformat=]
      DBGPRINT(RT_DEBUG_ERROR, ("AES_Key_Wrap: allocate %d bytes memory failure.
                                ^
/home/user/Stažené/RT3290/src/include/os/rt_linux.h:661:16: note: in definition of macro ‘DBGPRINT_RAW’
         printk Fmt;               \
                ^
/home/user/Stažené/RT3290/src/os/linux/../../common/crypt_aes.c:1466:6: note: in expansion of macro ‘DBGPRINT’
      DBGPRINT(RT_DEBUG_ERROR, ("AES_Key_Wrap: allocate %d bytes memory failure.
      ^
/home/user/Stažené/RT3290/src/os/linux/../../common/crypt_aes.c: In function ‘AES_Key_Unwrap’:
/home/user/Stažené/RT3290/src/os/linux/../../common/crypt_aes.c:1561:32: warning: format ‘%d’ expects argument of type ‘int’, but argument 2 has type ‘long unsigned int’ [-Wformat=]
      DBGPRINT(RT_DEBUG_ERROR, ("AES_Key_Unwrap: allocate %d bytes memory failur
                                ^
/home/user/Stažené/RT3290/src/include/os/rt_linux.h:661:16: note: in definition of macro ‘DBGPRINT_RAW’
         printk Fmt;               \
                ^
/home/user/Stažené/RT3290/src/os/linux/../../common/crypt_aes.c:1561:6: note: in expansion of macro ‘DBGPRINT’
      DBGPRINT(RT_DEBUG_ERROR, ("AES_Key_Unwrap: allocate %d bytes memory failur
      ^
  CC [M]  /home/user/Stažené/RT3290/src/os/linux/../../common/crypt_arc4.o
  CC [M]  /home/user/Stažené/RT3290/src/os/linux/../../common/mlme.o
In file included from /home/user/Stažené/RT3290/src/include/rtmp_os.h:42:0,
                 from /home/user/Stažené/RT3290/src/include/rtmp_comm.h:56,
                 from /home/user/Stažené/RT3290/src/include/rt_config.h:36,
                 from /home/user/Stažené/RT3290/src/os/linux/../../common/mlme.c:30:
/home/user/Stažené/RT3290/src/os/linux/../../common/mlme.c: In function ‘MlmeResetRalinkCounters’:
/home/user/Stažené/RT3290/src/os/linux/../../common/mlme.c:529:7: warning: cast from pointer to integer of different size [-Wpointer-to-int-cast]
       (UINT32)&pAd->RalinkCounters.OneSecEnd -
       ^
/home/user/Stažené/RT3290/src/include/os/rt_linux.h:468:76: note: in definition of macro ‘NdisZeroMemory’
 ine NdisZeroMemory(Destination, Length)         memset(Destination, 0, Length)
                                                                        ^
/home/user/Stažené/RT3290/src/os/linux/../../common/mlme.c:530:7: warning: cast from pointer to integer of different size [-Wpointer-to-int-cast]
       (UINT32)&pAd->RalinkCounters.OneSecStart);
       ^
/home/user/Stažené/RT3290/src/include/os/rt_linux.h:468:76: note: in definition of macro ‘NdisZeroMemory’
 ine NdisZeroMemory(Destination, Length)         memset(Destination, 0, Length)
                                                                        ^
  CC [M]  /home/user/Stažené/RT3290/src/os/linux/../../common/cmm_wep.o
  CC [M]  /home/user/Stažené/RT3290/src/os/linux/../../common/action.o
  CC [M]  /home/user/Stažené/RT3290/src/os/linux/../../common/cmm_data.o
  CC [M]  /home/user/Stažené/RT3290/src/os/linux/../../common/rtmp_init.o
  CC [M]  /home/user/Stažené/RT3290/src/os/linux/../../common/rtmp_init_inf.o
In file included from /home/user/Stažené/RT3290/src/include/rtmp_os.h:42:0,
                 from /home/user/Stažené/RT3290/src/include/rtmp_comm.h:56,
                 from /home/user/Stažené/RT3290/src/include/rt_config.h:36,
                 from /home/user/Stažené/RT3290/src/os/linux/../../common/rtmp_init_inf.c:28:
/home/user/Stažené/RT3290/src/os/linux/../../common/rtmp_init_inf.c: In function ‘rt28xx_init’:
/home/user/Stažené/RT3290/src/os/linux/../../common/rtmp_init_inf.c:162:26: warning: format ‘%x’ expects argument of type ‘unsigned int’, but argument 2 has type ‘ULONG {aka long unsigned int}’ [-Wformat=]
   DBGPRINT(RT_DEBUG_OFF,("PllCtrl:0x%x\n",PllCtrl.word));
                          ^
/home/user/Stažené/RT3290/src/include/os/rt_linux.h:661:16: note: in definition of macro ‘DBGPRINT_RAW’
         printk Fmt;               \
                ^
/home/user/Stažené/RT3290/src/os/linux/../../common/rtmp_init_inf.c:162:3: note: in expansion of macro ‘DBGPRINT’
   DBGPRINT(RT_DEBUG_OFF,("PllCtrl:0x%x\n",PllCtrl.word));
   ^
/home/user/Stažené/RT3290/src/os/linux/../../common/rtmp_init_inf.c:178:10: warning: ISO C90 forbids mixed declarations and code [-Wdeclaration-after-statement]
          AUTO_WAKEUP_STRUC AutoWakeupCfg;
          ^
  CC [M]  /home/user/Stažené/RT3290/src/os/linux/../../common/cmm_tkip.o
  CC [M]  /home/user/Stažené/RT3290/src/os/linux/../../common/cmm_aes.o
  CC [M]  /home/user/Stažené/RT3290/src/os/linux/../../common/cmm_sync.o
  CC [M]  /home/user/Stažené/RT3290/src/os/linux/../../common/eeprom.o
  CC [M]  /home/user/Stažené/RT3290/src/os/linux/../../common/cmm_sanity.o
  CC [M]  /home/user/Stažené/RT3290/src/os/linux/../../common/cmm_info.o
  CC [M]  /home/user/Stažené/RT3290/src/os/linux/../../common/cmm_cfg.o
  CC [M]  /home/user/Stažené/RT3290/src/os/linux/../../common/cmm_wpa.o
/home/user/Stažené/RT3290/src/os/linux/../../common/cmm_wpa.c: In function ‘PeerPairMsg3Action’:
/home/user/Stažené/RT3290/src/os/linux/../../common/cmm_wpa.c:1032:13: warning: unused variable ‘Cancelled’ [-Wunused-variable]
  BOOLEAN    Cancelled;
             ^
  CC [M]  /home/user/Stažené/RT3290/src/os/linux/../../common/cmm_radar.o
  CC [M]  /home/user/Stažené/RT3290/src/os/linux/../../common/spectrum.o
In file included from /home/user/Stažené/RT3290/src/include/rtmp_os.h:42:0,
                 from /home/user/Stažené/RT3290/src/include/rtmp_comm.h:56,
                 from /home/user/Stažené/RT3290/src/include/rt_config.h:36,
                 from /home/user/Stažené/RT3290/src/os/linux/../../common/spectrum.c:28:
/home/user/Stažené/RT3290/src/os/linux/../../common/spectrum.c: In function ‘PeerMeasureReportAction’:
/home/user/Stažené/RT3290/src/os/linux/../../common/spectrum.c:1972:29: warning: format ‘%d’ expects argument of type ‘int’, but argument 3 has type ‘long unsigned int’ [-Wformat=]
   DBGPRINT(RT_DEBUG_ERROR, ("%s unable to alloc memory for measure report buffe
                             ^
/home/user/Stažené/RT3290/src/include/os/rt_linux.h:661:16: note: in definition of macro ‘DBGPRINT_RAW’
         printk Fmt;               \
                ^
/home/user/Stažené/RT3290/src/os/linux/../../common/spectrum.c:1972:3: note: in expansion of macro ‘DBGPRINT’
   DBGPRINT(RT_DEBUG_ERROR, ("%s unable to alloc memory for measure report buffe
   ^
  CC [M]  /home/user/Stažené/RT3290/src/os/linux/../../common/rtmp_timer.o
  CC [M]  /home/user/Stažené/RT3290/src/os/linux/../../common/rt_channel.o
  CC [M]  /home/user/Stažené/RT3290/src/os/linux/../../common/cmm_profile.o
  CC [M]  /home/user/Stažené/RT3290/src/os/linux/../../common/cmm_asic.o
  CC [M]  /home/user/Stažené/RT3290/src/os/linux/../../common/cmm_cmd.o
  CC [M]  /home/user/Stažené/RT3290/src/os/linux/../../common/ps.o
  CC [M]  /home/user/Stažené/RT3290/src/os/linux/../../common/uapsd.o
  CC [M]  /home/user/Stažené/RT3290/src/os/linux/../../rate_ctrl/ra_ctrl.o
  CC [M]  /home/user/Stažené/RT3290/src/os/linux/../../rate_ctrl/alg_legacy.o
  CC [M]  /home/user/Stažené/RT3290/src/os/linux/../../rate_ctrl/alg_ags.o
  CC [M]  /home/user/Stažené/RT3290/src/os/linux/../../os/linux/rt_profile.o
In file included from /home/user/Stažené/RT3290/src/include/rtmp_os.h:42:0,
                 from /home/user/Stažené/RT3290/src/include/rtmp_comm.h:56,
                 from /home/user/Stažené/RT3290/src/include/rt_config.h:36,
                 from /home/user/Stažené/RT3290/src/os/linux/../../os/linux/rt_profile.c:26:
/home/user/Stažené/RT3290/src/os/linux/../../os/linux/rt_profile.c: In function ‘STA_MonPktSend’:
/home/user/Stažené/RT3290/src/os/linux/../../os/linux/rt_profile.c:409:35: warning: format ‘%d’ expects argument of type ‘int’, but argument 3 has type ‘long unsigned int’ [-Wformat=]
         DBGPRINT(RT_DEBUG_ERROR, ("%s : Size is too large! (%d)\n", __FUNCTION_
                                   ^
/home/user/Stažené/RT3290/src/include/os/rt_linux.h:661:16: note: in definition of macro ‘DBGPRINT_RAW’
         printk Fmt;               \
                ^
/home/user/Stažené/RT3290/src/os/linux/../../os/linux/rt_profile.c:409:9: note: in expansion of macro ‘DBGPRINT’
         DBGPRINT(RT_DEBUG_ERROR, ("%s : Size is too large! (%d)\n", __FUNCTION_
         ^
  CC [M]  /home/user/Stažené/RT3290/src/os/linux/../../chips/rtmp_chip.o
  CC [M]  /home/user/Stažené/RT3290/src/os/linux/../../sta/assoc.o
  CC [M]  /home/user/Stažené/RT3290/src/os/linux/../../sta/auth.o
  CC [M]  /home/user/Stažené/RT3290/src/os/linux/../../sta/auth_rsp.o
  CC [M]  /home/user/Stažené/RT3290/src/os/linux/../../sta/sync.o
  CC [M]  /home/user/Stažené/RT3290/src/os/linux/../../sta/sanity.o
  CC [M]  /home/user/Stažené/RT3290/src/os/linux/../../sta/rtmp_data.o
/home/user/Stažené/RT3290/src/os/linux/../../sta/rtmp_data.c: In function ‘STAHandleRxDataFrame’:
/home/user/Stažené/RT3290/src/os/linux/../../sta/rtmp_data.c:283:17: warning: unused variable ‘pFmeCtrl’ [-Wunused-variable]
  FRAME_CONTROL *pFmeCtrl = &pHeader->FC;
                 ^
/home/user/Stažené/RT3290/src/os/linux/../../sta/rtmp_data.c:282:8: warning: unused variable ‘OldPwrMgmt’ [-Wunused-variable]
  UCHAR OldPwrMgmt = PWR_ACTIVE;
        ^
/home/user/Stažené/RT3290/src/os/linux/../../sta/rtmp_data.c: In function ‘STAHandleRxMgmtFrame’:
/home/user/Stažené/RT3290/src/os/linux/../../sta/rtmp_data.c:766:5: warning: ISO C90 forbids mixed declarations and code [-Wdeclaration-after-statement]
     UCHAR uRSSI2;
     ^
  CC [M]  /home/user/Stažené/RT3290/src/os/linux/../../sta/connect.o
  CC [M]  /home/user/Stažené/RT3290/src/os/linux/../../sta/wpa.o
  CC [M]  /home/user/Stažené/RT3290/src/os/linux/../../sta/sta_cfg.o
In file included from /home/user/Stažené/RT3290/src/include/rtmp_os.h:42:0,
                 from /home/user/Stažené/RT3290/src/include/rtmp_comm.h:56,
                 from /home/user/Stažené/RT3290/src/include/rt_config.h:36,
                 from /home/user/Stažené/RT3290/src/os/linux/../../sta/sta_cfg.c:31:
/home/user/Stažené/RT3290/src/os/linux/../../sta/sta_cfg.c: In function ‘RTMPQueryInformation’:
/home/user/Stažené/RT3290/src/os/linux/../../sta/sta_cfg.c:3956:30: warning: format ‘%d’ expects argument of type ‘int’, but argument 2 has type ‘long unsigned int’ [-Wformat=]
    DBGPRINT(RT_DEBUG_TRACE, ("sizeof UCHAR=%d, channel=%d \n", sizeof(UCHAR), p
                              ^
/home/user/Stažené/RT3290/src/include/os/rt_linux.h:661:16: note: in definition of macro ‘DBGPRINT_RAW’
         printk Fmt;               \
                ^
/home/user/Stažené/RT3290/src/os/linux/../../sta/sta_cfg.c:3956:4: note: in expansion of macro ‘DBGPRINT’
    DBGPRINT(RT_DEBUG_TRACE, ("sizeof UCHAR=%d, channel=%d \n", sizeof(UCHAR), p
    ^
/home/user/Stažené/RT3290/src/os/linux/../../sta/sta_cfg.c: In function ‘RtmpIoctl_rt_private_get_statistics’:
/home/user/Stažené/RT3290/src/os/linux/../../sta/sta_cfg.c:7220:30: warning: format ‘%x’ expects argument of type ‘unsigned int’, but argument 3 has type ‘EEPROM_NIC_CONFIG3_STRUC {aka union _EEPROM_NIC_CINFIG3_STRUC}’ [-Wformat=]
 sprintf(extra+strlen(extra), "pAd->NicConfig3.field.CoexAnt == 0x%x\n\n",pAd->N
                              ^
  CC [M]  /home/user/Stažené/RT3290/src/os/linux/../../common/rt_os_util.o
  CC [M]  /home/user/Stažené/RT3290/src/os/linux/../../os/linux/sta_ioctl.o
  CC [M]  /home/user/Stažené/RT3290/src/os/linux/../../os/linux/rt_linux.o
In file included from /home/user/Stažené/RT3290/src/include/rtmp_os.h:42:0,
                 from /home/user/Stažené/RT3290/src/include/rtmp_comm.h:56,
                 from /home/user/Stažené/RT3290/src/os/linux/../../os/linux/rt_linux.c:35:
/home/user/Stažené/RT3290/src/os/linux/../../os/linux/rt_linux.c: In function ‘CFG80211_SupBandInit’:
/home/user/Stažené/RT3290/src/os/linux/../../os/linux/rt_linux.c:2600:31: warning: format ‘%d’ expects argument of type ‘int’, but argument 2 has type ‘long unsigned int’ [-Wformat=]
  CFG80211DBG(RT_DEBUG_ERROR, ("80211> Number of channel = %d\n",
                               ^
/home/user/Stažené/RT3290/src/include/os/rt_linux.h:661:16: note: in definition of macro ‘DBGPRINT_RAW’
         printk Fmt;               \
                ^
/home/user/Stažené/RT3290/src/include/rtmp_comm.h:304:37: note: in expansion of macro ‘DBGPRINT’
 #define CFG80211DBG(__Flg, __pMsg)  DBGPRINT(__Flg, __pMsg)
                                     ^
/home/user/Stažené/RT3290/src/os/linux/../../os/linux/rt_linux.c:2600:2: note: in expansion of macro ‘CFG80211DBG’
  CFG80211DBG(RT_DEBUG_ERROR, ("80211> Number of channel = %d\n",
  ^
/home/user/Stažené/RT3290/src/os/linux/../../os/linux/rt_linux.c:2629:6: error: too few arguments to function ‘ieee80211_channel_to_frequency’
      ieee80211_channel_to_frequency(Cfg80211_Chan[IdLoop]);
      ^
In file included from include/net/mac80211.h:23:0,
                 from /home/user/Stažené/RT3290/src/include/os/rt_linux.h:60,
                 from /home/user/Stažené/RT3290/src/include/rtmp_os.h:42,
                 from /home/user/Stažené/RT3290/src/include/rtmp_comm.h:56,
                 from /home/user/Stažené/RT3290/src/os/linux/../../os/linux/rt_linux.c:35:
include/net/cfg80211.h:3590:5: note: declared here
 int ieee80211_channel_to_frequency(int chan, enum ieee80211_band band);
     ^
/home/user/Stažené/RT3290/src/os/linux/../../os/linux/rt_linux.c: In function ‘CFG80211OS_ChanInfoInit’:
/home/user/Stažené/RT3290/src/os/linux/../../os/linux/rt_linux.c:3045:23: error: too few arguments to function ‘ieee80211_channel_to_frequency’
  pChan->center_freq = ieee80211_channel_to_frequency(ChanId);
                       ^
In file included from include/net/mac80211.h:23:0,
                 from /home/user/Stažené/RT3290/src/include/os/rt_linux.h:60,
                 from /home/user/Stažené/RT3290/src/include/rtmp_os.h:42,
                 from /home/user/Stažené/RT3290/src/include/rtmp_comm.h:56,
                 from /home/user/Stažené/RT3290/src/os/linux/../../os/linux/rt_linux.c:35:
include/net/cfg80211.h:3590:5: note: declared here
 int ieee80211_channel_to_frequency(int chan, enum ieee80211_band band);
     ^
/home/user/Stažené/RT3290/src/os/linux/../../os/linux/rt_linux.c: In function ‘CFG80211OS_Scaning’:
/home/user/Stažené/RT3290/src/os/linux/../../os/linux/rt_linux.c:3102:12: error: too few arguments to function ‘ieee80211_channel_to_frequency’
  CenFreq = ieee80211_channel_to_frequency(ChanId);
            ^
In file included from include/net/mac80211.h:23:0,
                 from /home/user/Stažené/RT3290/src/include/os/rt_linux.h:60,
                 from /home/user/Stažené/RT3290/src/include/rtmp_os.h:42,
                 from /home/user/Stažené/RT3290/src/include/rtmp_comm.h:56,
                 from /home/user/Stažené/RT3290/src/os/linux/../../os/linux/rt_linux.c:35:
include/net/cfg80211.h:3590:5: note: declared here
 int ieee80211_channel_to_frequency(int chan, enum ieee80211_band band);
     ^
scripts/Makefile.build:258: návod pro cíl „/home/user/Stažené/RT3290/src/os/linux/../../os/linux/rt_linux.o“ selhal
make[2]: *** [/home/user/Stažené/RT3290/src/os/linux/../../os/linux/rt_linux.o] Chyba 1
Makefile:1420: návod pro cíl „_module_/home/user/Stažené/RT3290/src/os/linux“ selhal
make[1]: *** [_module_/home/user/Stažené/RT3290/src/os/linux] Chyba 2
make[1]: Opouští se adresář „/usr/src/linux-headers-4.4.0-88-generic“
Makefile:380: návod pro cíl „LINUX“ selhal
make: *** [LINUX] Chyba 2
root@HP-655-Xubuntu:/home/user/Stažené/RT3290/src# make clean
cp -f os/linux/Makefile.clean os/linux/Makefile
make -C os/linux clean
make[1]: Vstupuje se do adresáře „/home/user/Stažené/RT3290/src/os/linux“
rm /home/user/Stažené/RT3290/src/common/*.o
rm /home/user/Stažené/RT3290/src/common/.*.{cmd,flags,d}
rm: nelze odstranit '/home/user/Stažené/RT3290/src/common/.*.{cmd,flags,d}': Adresář nebo soubor neexistuje
Makefile:7: návod pro cíl „clean“ selhal
make[1]: [clean] Chyba 1 (ignorováno)
rm /home/user/Stažené/RT3290/src/os/linux/*.{o,ko,mod.{o,c}}
rm: nelze odstranit '/home/user/Stažené/RT3290/src/os/linux/*.{o,ko,mod.{o,c}}': Adresář nebo soubor neexistuje
Makefile:7: návod pro cíl „clean“ selhal
make[1]: [clean] Chyba 1 (ignorováno)
rm /home/user/Stažené/RT3290/src/os/linux/.*.{cmd,flags,d}
rm: nelze odstranit '/home/user/Stažené/RT3290/src/os/linux/.*.{cmd,flags,d}': Adresář nebo soubor neexistuje
Makefile:7: návod pro cíl „clean“ selhal
make[1]: [clean] Chyba 1 (ignorováno)
rm -r /home/user/Stažené/RT3290/src/os/linux/.tmp_versions
rm /home/user/Stažené/RT3290/src/os/linux/Module.symvers
rm: nelze odstranit '/home/user/Stažené/RT3290/src/os/linux/Module.symvers': Adresář nebo soubor neexistuje
Makefile:7: návod pro cíl „clean“ selhal
make[1]: [clean] Chyba 1 (ignorováno)
rm /home/user/Stažené/RT3290/src/os/linux/Modules.symvers
rm: nelze odstranit '/home/user/Stažené/RT3290/src/os/linux/Modules.symvers': Adresář nebo soubor neexistuje
Makefile:7: návod pro cíl „clean“ selhal
make[1]: [clean] Chyba 1 (ignorováno)
rm /home/user/Stažené/RT3290/src/os/linux/Module.markers
rm: nelze odstranit '/home/user/Stažené/RT3290/src/os/linux/Module.markers': Adresář nebo soubor neexistuje
Makefile:7: návod pro cíl „clean“ selhal
make[1]: [clean] Chyba 1 (ignorováno)
rm /home/user/Stažené/RT3290/src/os/linux/modules.order
rm: nelze odstranit '/home/user/Stažené/RT3290/src/os/linux/modules.order': Adresář nebo soubor neexistuje
Makefile:7: návod pro cíl „clean“ selhal
make[1]: [clean] Chyba 1 (ignorováno)
rm /home/user/Stažené/RT3290/src/chips/*.o
rm /home/user/Stažené/RT3290/src/chips/.*.{cmd,flags,d}
rm: nelze odstranit '/home/user/Stažené/RT3290/src/chips/.*.{cmd,flags,d}': Adresář nebo soubor neexistuje
Makefile:7: návod pro cíl „clean“ selhal
make[1]: [clean] Chyba 1 (ignorováno)
rm /home/user/Stažené/RT3290/src/rate_ctrl/*.o
rm /home/user/Stažené/RT3290/src/rate_ctrl/.*.{cmd,flags,d}
rm: nelze odstranit '/home/user/Stažené/RT3290/src/rate_ctrl/.*.{cmd,flags,d}': Adresář nebo soubor neexistuje
Makefile:7: návod pro cíl „clean“ selhal
make[1]: [clean] Chyba 1 (ignorováno)
rm /home/user/Stažené/RT3290/src/ate/common/*.o
rm: nelze odstranit '/home/user/Stažené/RT3290/src/ate/common/*.o': Adresář nebo soubor neexistuje
Makefile:7: návod pro cíl „clean“ selhal
make[1]: [clean] Chyba 1 (ignorováno)
rm /home/user/Stažené/RT3290/src/ate/common/.*.{cmd,flags,d}
rm: nelze odstranit '/home/user/Stažené/RT3290/src/ate/common/.*.{cmd,flags,d}': Adresář nebo soubor neexistuje
Makefile:7: návod pro cíl „clean“ selhal
make[1]: [clean] Chyba 1 (ignorováno)
rm /home/user/Stažené/RT3290/src/ate/chips/*.o
rm: nelze odstranit '/home/user/Stažené/RT3290/src/ate/chips/*.o': Adresář nebo soubor neexistuje
Makefile:7: návod pro cíl „clean“ selhal
make[1]: [clean] Chyba 1 (ignorováno)
rm /home/user/Stažené/RT3290/src/ate/chips/.*.{cmd,flags,d}
rm: nelze odstranit '/home/user/Stažené/RT3290/src/ate/chips/.*.{cmd,flags,d}': Adresář nebo soubor neexistuje
Makefile:7: návod pro cíl „clean“ selhal
make[1]: [clean] Chyba 1 (ignorováno)
rm /home/user/Stažené/RT3290/src/sta/*.o
rm /home/user/Stažené/RT3290/src/sta/.*.{cmd,flags,d}
rm: nelze odstranit '/home/user/Stažené/RT3290/src/sta/.*.{cmd,flags,d}': Adresář nebo soubor neexistuje
Makefile:7: návod pro cíl „clean“ selhal
make[1]: [clean] Chyba 1 (ignorováno)
make[1]: Opouští se adresář „/home/user/Stažené/RT3290/src/os/linux“
rm -rf os/linux/Makefile
root@HP-655-Xubuntu:/home/user/Stažené/RT3290/src# make
make -C tools
make[1]: Vstupuje se do adresáře „/home/user/Stažené/RT3290/src/tools“
gcc -g bin2h.c -o bin2h
chmod +x bin2h
make[1]: Opouští se adresář „/home/user/Stažené/RT3290/src/tools“
/home/user/Stažené/RT3290/src/tools/bin2h
cp -f os/linux/Makefile.6 /home/user/Stažené/RT3290/src/os/linux/Makefile
make -C /lib/modules/4.4.0-88-generic/build SUBDIRS=/home/user/Stažené/RT3290/src/os/linux modules
make[1]: Vstupuje se do adresáře „/usr/src/linux-headers-4.4.0-88-generic“
  CC [M]  /home/user/Stažené/RT3290/src/os/linux/../../common/crypt_md5.o
  CC [M]  /home/user/Stažené/RT3290/src/os/linux/../../common/crypt_sha2.o
  CC [M]  /home/user/Stažené/RT3290/src/os/linux/../../common/crypt_hmac.o
  CC [M]  /home/user/Stažené/RT3290/src/os/linux/../../common/crypt_aes.o
In file included from /home/user/Stažené/RT3290/src/include/rtmp_os.h:42:0,
                 from /home/user/Stažené/RT3290/src/include/rtmp_comm.h:56,
                 from /home/user/Stažené/RT3290/src/include/rt_config.h:36,
                 from /home/user/Stažené/RT3290/src/include/crypt_aes.h:38,
                 from /home/user/Stažené/RT3290/src/os/linux/../../common/crypt_aes.c:35:
/home/user/Stažené/RT3290/src/os/linux/../../common/crypt_aes.c: In function ‘AES_Key_Wrap’:
/home/user/Stažené/RT3290/src/os/linux/../../common/crypt_aes.c:1466:32: warning: format ‘%d’ expects argument of type ‘int’, but argument 2 has type ‘long unsigned int’ [-Wformat=]
      DBGPRINT(RT_DEBUG_ERROR, ("AES_Key_Wrap: allocate %d bytes memory failure.
                                ^
/home/user/Stažené/RT3290/src/include/os/rt_linux.h:661:16: note: in definition of macro ‘DBGPRINT_RAW’
         printk Fmt;               \
                ^
/home/user/Stažené/RT3290/src/os/linux/../../common/crypt_aes.c:1466:6: note: in expansion of macro ‘DBGPRINT’
      DBGPRINT(RT_DEBUG_ERROR, ("AES_Key_Wrap: allocate %d bytes memory failure.
      ^
/home/user/Stažené/RT3290/src/os/linux/../../common/crypt_aes.c: In function ‘AES_Key_Unwrap’:
/home/user/Stažené/RT3290/src/os/linux/../../common/crypt_aes.c:1561:32: warning: format ‘%d’ expects argument of type ‘int’, but argument 2 has type ‘long unsigned int’ [-Wformat=]
      DBGPRINT(RT_DEBUG_ERROR, ("AES_Key_Unwrap: allocate %d bytes memory failur
                                ^
/home/user/Stažené/RT3290/src/include/os/rt_linux.h:661:16: note: in definition of macro ‘DBGPRINT_RAW’
         printk Fmt;               \
                ^
/home/user/Stažené/RT3290/src/os/linux/../../common/crypt_aes.c:1561:6: note: in expansion of macro ‘DBGPRINT’
      DBGPRINT(RT_DEBUG_ERROR, ("AES_Key_Unwrap: allocate %d bytes memory failur
      ^
  CC [M]  /home/user/Stažené/RT3290/src/os/linux/../../common/crypt_arc4.o
  CC [M]  /home/user/Stažené/RT3290/src/os/linux/../../common/mlme.o
In file included from /home/user/Stažené/RT3290/src/include/rtmp_os.h:42:0,
                 from /home/user/Stažené/RT3290/src/include/rtmp_comm.h:56,
                 from /home/user/Stažené/RT3290/src/include/rt_config.h:36,
                 from /home/user/Stažené/RT3290/src/os/linux/../../common/mlme.c:30:
/home/user/Stažené/RT3290/src/os/linux/../../common/mlme.c: In function ‘MlmeResetRalinkCounters’:
/home/user/Stažené/RT3290/src/os/linux/../../common/mlme.c:529:7: warning: cast from pointer to integer of different size [-Wpointer-to-int-cast]
       (UINT32)&pAd->RalinkCounters.OneSecEnd -
       ^
/home/user/Stažené/RT3290/src/include/os/rt_linux.h:468:76: note: in definition of macro ‘NdisZeroMemory’
 ine NdisZeroMemory(Destination, Length)         memset(Destination, 0, Length)
                                                                        ^
/home/user/Stažené/RT3290/src/os/linux/../../common/mlme.c:530:7: warning: cast from pointer to integer of different size [-Wpointer-to-int-cast]
       (UINT32)&pAd->RalinkCounters.OneSecStart);
       ^
/home/user/Stažené/RT3290/src/include/os/rt_linux.h:468:76: note: in definition of macro ‘NdisZeroMemory’
 ine NdisZeroMemory(Destination, Length)         memset(Destination, 0, Length)
                                                                        ^
  CC [M]  /home/user/Stažené/RT3290/src/os/linux/../../common/cmm_wep.o
  CC [M]  /home/user/Stažené/RT3290/src/os/linux/../../common/action.o
  CC [M]  /home/user/Stažené/RT3290/src/os/linux/../../common/cmm_data.o
  CC [M]  /home/user/Stažené/RT3290/src/os/linux/../../common/rtmp_init.o
  CC [M]  /home/user/Stažené/RT3290/src/os/linux/../../common/rtmp_init_inf.o
In file included from /home/user/Stažené/RT3290/src/include/rtmp_os.h:42:0,
                 from /home/user/Stažené/RT3290/src/include/rtmp_comm.h:56,
                 from /home/user/Stažené/RT3290/src/include/rt_config.h:36,
                 from /home/user/Stažené/RT3290/src/os/linux/../../common/rtmp_init_inf.c:28:
/home/user/Stažené/RT3290/src/os/linux/../../common/rtmp_init_inf.c: In function ‘rt28xx_init’:
/home/user/Stažené/RT3290/src/os/linux/../../common/rtmp_init_inf.c:162:26: warning: format ‘%x’ expects argument of type ‘unsigned int’, but argument 2 has type ‘ULONG {aka long unsigned int}’ [-Wformat=]
   DBGPRINT(RT_DEBUG_OFF,("PllCtrl:0x%x\n",PllCtrl.word));
                          ^
/home/user/Stažené/RT3290/src/include/os/rt_linux.h:661:16: note: in definition of macro ‘DBGPRINT_RAW’
         printk Fmt;               \
                ^
/home/user/Stažené/RT3290/src/os/linux/../../common/rtmp_init_inf.c:162:3: note: in expansion of macro ‘DBGPRINT’
   DBGPRINT(RT_DEBUG_OFF,("PllCtrl:0x%x\n",PllCtrl.word));
   ^
/home/user/Stažené/RT3290/src/os/linux/../../common/rtmp_init_inf.c:178:10: warning: ISO C90 forbids mixed declarations and code [-Wdeclaration-after-statement]
          AUTO_WAKEUP_STRUC AutoWakeupCfg;
          ^
  CC [M]  /home/user/Stažené/RT3290/src/os/linux/../../common/cmm_tkip.o
  CC [M]  /home/user/Stažené/RT3290/src/os/linux/../../common/cmm_aes.o
  CC [M]  /home/user/Stažené/RT3290/src/os/linux/../../common/cmm_sync.o
  CC [M]  /home/user/Stažené/RT3290/src/os/linux/../../common/eeprom.o
  CC [M]  /home/user/Stažené/RT3290/src/os/linux/../../common/cmm_sanity.o
  CC [M]  /home/user/Stažené/RT3290/src/os/linux/../../common/cmm_info.o
  CC [M]  /home/user/Stažené/RT3290/src/os/linux/../../common/cmm_cfg.o
  CC [M]  /home/user/Stažené/RT3290/src/os/linux/../../common/cmm_wpa.o
/home/user/Stažené/RT3290/src/os/linux/../../common/cmm_wpa.c: In function ‘PeerPairMsg3Action’:
/home/user/Stažené/RT3290/src/os/linux/../../common/cmm_wpa.c:1032:13: warning: unused variable ‘Cancelled’ [-Wunused-variable]
  BOOLEAN    Cancelled;
             ^
  CC [M]  /home/user/Stažené/RT3290/src/os/linux/../../common/cmm_radar.o
  CC [M]  /home/user/Stažené/RT3290/src/os/linux/../../common/spectrum.o
In file included from /home/user/Stažené/RT3290/src/include/rtmp_os.h:42:0,
                 from /home/user/Stažené/RT3290/src/include/rtmp_comm.h:56,
                 from /home/user/Stažené/RT3290/src/include/rt_config.h:36,
                 from /home/user/Stažené/RT3290/src/os/linux/../../common/spectrum.c:28:
/home/user/Stažené/RT3290/src/os/linux/../../common/spectrum.c: In function ‘PeerMeasureReportAction’:
/home/user/Stažené/RT3290/src/os/linux/../../common/spectrum.c:1972:29: warning: format ‘%d’ expects argument of type ‘int’, but argument 3 has type ‘long unsigned int’ [-Wformat=]
   DBGPRINT(RT_DEBUG_ERROR, ("%s unable to alloc memory for measure report buffe
                             ^
/home/user/Stažené/RT3290/src/include/os/rt_linux.h:661:16: note: in definition of macro ‘DBGPRINT_RAW’
         printk Fmt;               \
                ^
/home/user/Stažené/RT3290/src/os/linux/../../common/spectrum.c:1972:3: note: in expansion of macro ‘DBGPRINT’
   DBGPRINT(RT_DEBUG_ERROR, ("%s unable to alloc memory for measure report buffe
   ^
  CC [M]  /home/user/Stažené/RT3290/src/os/linux/../../common/rtmp_timer.o
  CC [M]  /home/user/Stažené/RT3290/src/os/linux/../../common/rt_channel.o
  CC [M]  /home/user/Stažené/RT3290/src/os/linux/../../common/cmm_profile.o
  CC [M]  /home/user/Stažené/RT3290/src/os/linux/../../common/cmm_asic.o
  CC [M]  /home/user/Stažené/RT3290/src/os/linux/../../common/cmm_cmd.o
  CC [M]  /home/user/Stažené/RT3290/src/os/linux/../../common/ps.o
  CC [M]  /home/user/Stažené/RT3290/src/os/linux/../../common/uapsd.o
  CC [M]  /home/user/Stažené/RT3290/src/os/linux/../../rate_ctrl/ra_ctrl.o
  CC [M]  /home/user/Stažené/RT3290/src/os/linux/../../rate_ctrl/alg_legacy.o
  CC [M]  /home/user/Stažené/RT3290/src/os/linux/../../rate_ctrl/alg_ags.o
  CC [M]  /home/user/Stažené/RT3290/src/os/linux/../../chips/rtmp_chip.o
  CC [M]  /home/user/Stažené/RT3290/src/os/linux/../../sta/assoc.o
  CC [M]  /home/user/Stažené/RT3290/src/os/linux/../../sta/auth.o
  CC [M]  /home/user/Stažené/RT3290/src/os/linux/../../sta/auth_rsp.o
  CC [M]  /home/user/Stažené/RT3290/src/os/linux/../../sta/sync.o
  CC [M]  /home/user/Stažené/RT3290/src/os/linux/../../sta/sanity.o
  CC [M]  /home/user/Stažené/RT3290/src/os/linux/../../sta/rtmp_data.o
/home/user/Stažené/RT3290/src/os/linux/../../sta/rtmp_data.c: In function ‘STAHandleRxDataFrame’:
/home/user/Stažené/RT3290/src/os/linux/../../sta/rtmp_data.c:283:17: warning: unused variable ‘pFmeCtrl’ [-Wunused-variable]
  FRAME_CONTROL *pFmeCtrl = &pHeader->FC;
                 ^
/home/user/Stažené/RT3290/src/os/linux/../../sta/rtmp_data.c:282:8: warning: unused variable ‘OldPwrMgmt’ [-Wunused-variable]
  UCHAR OldPwrMgmt = PWR_ACTIVE;
        ^
/home/user/Stažené/RT3290/src/os/linux/../../sta/rtmp_data.c: In function ‘STAHandleRxMgmtFrame’:
/home/user/Stažené/RT3290/src/os/linux/../../sta/rtmp_data.c:766:5: warning: ISO C90 forbids mixed declarations and code [-Wdeclaration-after-statement]
     UCHAR uRSSI2;
     ^
  CC [M]  /home/user/Stažené/RT3290/src/os/linux/../../sta/connect.o
  CC [M]  /home/user/Stažené/RT3290/src/os/linux/../../sta/wpa.o
  CC [M]  /home/user/Stažené/RT3290/src/os/linux/../../sta/sta_cfg.o
In file included from /home/user/Stažené/RT3290/src/include/rtmp_os.h:42:0,
                 from /home/user/Stažené/RT3290/src/include/rtmp_comm.h:56,
                 from /home/user/Stažené/RT3290/src/include/rt_config.h:36,
                 from /home/user/Stažené/RT3290/src/os/linux/../../sta/sta_cfg.c:31:
/home/user/Stažené/RT3290/src/os/linux/../../sta/sta_cfg.c: In function ‘RTMPQueryInformation’:
/home/user/Stažené/RT3290/src/os/linux/../../sta/sta_cfg.c:3956:30: warning: format ‘%d’ expects argument of type ‘int’, but argument 2 has type ‘long unsigned int’ [-Wformat=]
    DBGPRINT(RT_DEBUG_TRACE, ("sizeof UCHAR=%d, channel=%d \n", sizeof(UCHAR), p
                              ^
/home/user/Stažené/RT3290/src/include/os/rt_linux.h:661:16: note: in definition of macro ‘DBGPRINT_RAW’
         printk Fmt;               \
                ^
/home/user/Stažené/RT3290/src/os/linux/../../sta/sta_cfg.c:3956:4: note: in expansion of macro ‘DBGPRINT’
    DBGPRINT(RT_DEBUG_TRACE, ("sizeof UCHAR=%d, channel=%d \n", sizeof(UCHAR), p
    ^
/home/user/Stažené/RT3290/src/os/linux/../../sta/sta_cfg.c: In function ‘RtmpIoctl_rt_private_get_statistics’:
/home/user/Stažené/RT3290/src/os/linux/../../sta/sta_cfg.c:7220:30: warning: format ‘%x’ expects argument of type ‘unsigned int’, but argument 3 has type ‘EEPROM_NIC_CONFIG3_STRUC {aka union _EEPROM_NIC_CINFIG3_STRUC}’ [-Wformat=]
 sprintf(extra+strlen(extra), "pAd->NicConfig3.field.CoexAnt == 0x%x\n\n",pAd->N
                              ^
  CC [M]  /home/user/Stažené/RT3290/src/os/linux/../../common/rt_os_util.o
  CC [M]  /home/user/Stažené/RT3290/src/os/linux/../../os/linux/rt_linux.o
In file included from /home/user/Stažené/RT3290/src/include/rtmp_os.h:42:0,
                 from /home/user/Stažené/RT3290/src/include/rtmp_comm.h:56,
                 from /home/user/Stažené/RT3290/src/os/linux/../../os/linux/rt_linux.c:35:
/home/user/Stažené/RT3290/src/os/linux/../../os/linux/rt_linux.c: In function ‘CFG80211_SupBandInit’:
/home/user/Stažené/RT3290/src/os/linux/../../os/linux/rt_linux.c:2600:31: warning: format ‘%d’ expects argument of type ‘int’, but argument 2 has type ‘long unsigned int’ [-Wformat=]
  CFG80211DBG(RT_DEBUG_ERROR, ("80211> Number of channel = %d\n",
                               ^
/home/user/Stažené/RT3290/src/include/os/rt_linux.h:661:16: note: in definition of macro ‘DBGPRINT_RAW’
         printk Fmt;               \
                ^
/home/user/Stažené/RT3290/src/include/rtmp_comm.h:304:37: note: in expansion of macro ‘DBGPRINT’
 #define CFG80211DBG(__Flg, __pMsg)  DBGPRINT(__Flg, __pMsg)
                                     ^
/home/user/Stažené/RT3290/src/os/linux/../../os/linux/rt_linux.c:2600:2: note: in expansion of macro ‘CFG80211DBG’
  CFG80211DBG(RT_DEBUG_ERROR, ("80211> Number of channel = %d\n",
  ^
/home/user/Stažené/RT3290/src/os/linux/../../os/linux/rt_linux.c:2629:6: error: too few arguments to function ‘ieee80211_channel_to_frequency’
      ieee80211_channel_to_frequency(Cfg80211_Chan[IdLoop]);
      ^
In file included from include/net/mac80211.h:23:0,
                 from /home/user/Stažené/RT3290/src/include/os/rt_linux.h:60,
                 from /home/user/Stažené/RT3290/src/include/rtmp_os.h:42,
                 from /home/user/Stažené/RT3290/src/include/rtmp_comm.h:56,
                 from /home/user/Stažené/RT3290/src/os/linux/../../os/linux/rt_linux.c:35:
include/net/cfg80211.h:3590:5: note: declared here
 int ieee80211_channel_to_frequency(int chan, enum ieee80211_band band);
     ^
/home/user/Stažené/RT3290/src/os/linux/../../os/linux/rt_linux.c: In function ‘CFG80211OS_ChanInfoInit’:
/home/user/Stažené/RT3290/src/os/linux/../../os/linux/rt_linux.c:3045:23: error: too few arguments to function ‘ieee80211_channel_to_frequency’
  pChan->center_freq = ieee80211_channel_to_frequency(ChanId);
                       ^
In file included from include/net/mac80211.h:23:0,
                 from /home/user/Stažené/RT3290/src/include/os/rt_linux.h:60,
                 from /home/user/Stažené/RT3290/src/include/rtmp_os.h:42,
                 from /home/user/Stažené/RT3290/src/include/rtmp_comm.h:56,
                 from /home/user/Stažené/RT3290/src/os/linux/../../os/linux/rt_linux.c:35:
include/net/cfg80211.h:3590:5: note: declared here
 int ieee80211_channel_to_frequency(int chan, enum ieee80211_band band);
     ^
/home/user/Stažené/RT3290/src/os/linux/../../os/linux/rt_linux.c: In function ‘CFG80211OS_Scaning’:
/home/user/Stažené/RT3290/src/os/linux/../../os/linux/rt_linux.c:3102:12: error: too few arguments to function ‘ieee80211_channel_to_frequency’
  CenFreq = ieee80211_channel_to_frequency(ChanId);
            ^
In file included from include/net/mac80211.h:23:0,
                 from /home/user/Stažené/RT3290/src/include/os/rt_linux.h:60,
                 from /home/user/Stažené/RT3290/src/include/rtmp_os.h:42,
                 from /home/user/Stažené/RT3290/src/include/rtmp_comm.h:56,
                 from /home/user/Stažené/RT3290/src/os/linux/../../os/linux/rt_linux.c:35:
include/net/cfg80211.h:3590:5: note: declared here
 int ieee80211_channel_to_frequency(int chan, enum ieee80211_band band);
     ^
scripts/Makefile.build:258: návod pro cíl „/home/user/Stažené/RT3290/src/os/linux/../../os/linux/rt_linux.o“ selhal
make[2]: *** [/home/user/Stažené/RT3290/src/os/linux/../../os/linux/rt_linux.o] Chyba 1
Makefile:1420: návod pro cíl „_module_/home/user/Stažené/RT3290/src/os/linux“ selhal
make[1]: *** [_module_/home/user/Stažené/RT3290/src/os/linux] Chyba 2
make[1]: Opouští se adresář „/usr/src/linux-headers-4.4.0-88-generic“
Makefile:380: návod pro cíl „LINUX“ selhal
make: *** [LINUX] Chyba 2
root@HP-655-Xubuntu:/home/user/Stažené/RT3290/src# make install
make -C /home/user/Stažené/RT3290/src/os/linux -f Makefile.6 install
make[1]: Vstupuje se do adresáře „/home/user/Stažené/RT3290/src/os/linux“
mkdir: adresář „/etc/Wireless“ nelze vytvořit: Soubor již existuje
rm -rf /etc/Wireless/RT2860STA
mkdir /etc/Wireless/RT2860STA
cp /home/user/Stažené/RT3290/src/RT2860STA.dat /etc/Wireless/RT2860STA/.
install -d /lib/modules/4.4.0-88-generic/kernel/drivers/net/wireless/
install -m 644 -c rt3290sta.ko /lib/modules/4.4.0-88-generic/kernel/drivers/net/wireless/
/sbin/depmod -a 4.4.0-88-generic
make[1]: Opouští se adresář „/home/user/Stažené/RT3290/src/os/linux“

To asi nedopadlo dobře, že?

Zkoušel jsem potom ještě to make clean a instalovat po úpravách přes .Run.sh, to žádné chyby nehlásilo, ale stejně nefungovalo. A ani ten modul nefungoval:
Případně mohu zkusit ještě tuto verzi:

Updated package for Ubuntu 16.04 based distributions. Also suitable for Ubuntu 15.04 based distributions: http://www.mediafire.com/download/pu4rejmmft8z9yr/RT3290_u16_v1.tar.gz


Wifi ip ani ifconfig nevidí. Ale ve všech případech jsem narazil na tuto chybovou hlášku:

Kód: [Vybrat]
dmesg | grep 3290
[    0.447696] pci 0000:04:00.0: [1814:3290] type 00 class 0x028000
[   14.607784] rt3290sta: module license 'unspecified' taints kernel.
[   14.610629] rt3290sta: module verification failed: signature and/or required key missing - tainting kernel
[   14.614981] device_id =0x3290

Ubuntu mi ten ovladač nechce povolit, protože není podepsaný? Je to instalace v UEFI režimu, ale secure boot je vypnutý. Jádro je tam signed. Má to na to vliv?

Jak ten ovladač povolím?


17
Případně mohu zkusit ještě tuto verzi:

Updated package for Ubuntu 16.04 based distributions. Also suitable for Ubuntu 15.04 based distributions: http://www.mediafire.com/download/pu4rejmmft8z9yr/RT3290_u16_v1.tar.gz

18
A co z toho plyne? Mám nějak ovladač použít s tím wextem místo NL80211? Mám plně aktuální xubuntu 16.04, takže tam je určitě novější jádro. Jak?

Zde (https://askubuntu.com/questions/253632/how-do-i-get-a-ralink-rt3290-wireless-card-working) píšou ještě nějaké další úpravy:
Kód: [Vybrat]
make
sudo make install

Kód: [Vybrat]
modprobe rt3290sta
Pak ruční přidání do /etc/modules na konec souboru rt3290sta.

Pak přidání do blacklistu /etc/modprobe.d/blacklist.conf

Kód: [Vybrat]
#Wireless drivers conflicting with rt3562sta 
blacklist rt2800pci 
blacklist rt2x00pci

Ten blaklist ale vytváří automaticky již pouhá instalace přes Run.sh.

Instalaci přes ten Run.sh tam ani neuvádějí. Těžko říct, jestli v tom archivu ho měli nebo ne.

Po těchto úpravách spouští:

Kód: [Vybrat]
update-initramfs -u
### V jiné části návodu před kompilací ještě přidávají v souboru os/linux/pci_main_dev.c za #include někde nahoře:

Kód: [Vybrat]
#if LINUX_VERSION_CODE >= KERNEL_VERSION(3,8,0)
#define __devexit
#define __devinit
#define __devinitdata
#endif

A nahrazují:

Kód: [Vybrat]
#if LINUX_VERSION_CODE >= 0x20412
remove:     __devexit_p(rt2860_remove_one),
#else
remove:     __devexit(rt2860_remove_one),
#endif

za

Kód: [Vybrat]
#if LINUX_VERSION_CODE >= KERNEL_VERSION(3,8,0)
remove:     rt2860_remove_one,
#else
#if LINUX_VERSION_CODE >= 0x20412
remove:     __devexit_p(rt2860_remove_one),
#else
remove:     __devexit(rt2860_remove_one),
#endif
#endif

V tom souboru config.mk uvádí:
Kód: [Vybrat]
HAS_NATIVE_WPA_SUPPLICANT_SUPPORT=y
HAS_WPA_SUPPLICANT_SUPPORT=y

Takže správně by tedy mělo být tedy pro CFG80211:

Kód: [Vybrat]
HAS_NATIVE_WPA_SUPPLICANT_SUPPORT=y
HAS_WPA_SUPPLICANT_SUPPORT=y
HAS_CFG80211_SUPPORT=y
?

Prosím o doplnění, abych věděl, co přesě všechno měnit a jak postupovat s instalací...

Děkuji moc.

19
Díky, mrknu na to a dám vědět. Když to změním v souboru, stačí spustit přes ten Run.sh, který to kompiluje? Nebo musím nějak jinak ručně zkompilovat?

20
Zdravím, mám notebook HP65něco, je tam wifi rt3290. Tato karta byla pořádně podporovaná tuším do jádra 3.6, od té doby je tam ovladač, který se chová divně.

Problémy:
při vypnutí wifi a zapnutí network manager nevydí sítě. Někdy stačilo opravit takto:

Kód: [Vybrat]
systemctl restart NetworkManager
To by mohl být teoreticky i bug network manageru.

Další problémy: po rebootu nebo někdy po startu karta nejela vůbec, nedala se nahodit ani přes ifconfig, ani přes ifup, ani přes ip. Blokovaná přes rfkill nebyla. Pokus o nahození hlásil nějaký i/O error. To je zřejmě dobře známý problém - nekompatibilita aktuáních ovladačů.

Co jsem zkoušel:
Download the file from here and follow the following steps:
1.Extract the rt3290sta-2.6.0.0 directory into /usr/src.
2.Run sudo dkms install -m rt3290sta -v 2.6.0.0 --force.
3.Reboot.

And you should be good :)

Nepomohlo to, tak jsem tento dkms modul odinstaloval. Pak zase po vypnutí a zapnutí fungovalo, ale chyby byly jako dříve.

Dále jsem zkoušel:
stáhnout soubor http://www.mediafire.com/download/l3zoch2y1hbcali/RT3290.tar.gz
rozbalit, a spustit dle návodu vevnitř instalaci a kompilaci přes sudo ./Run.sh

Instalace OK, po několika rebootech se zdálo, že je vše OK, pak se to celé po jednom rebootu zničeho nic pokazilo a nešlo nic. Jediné, co jsem provedl, byla instalace miredo a konfigurace dyndns. Nicméně tyto úpravy by neměli mít vliv na funkčnost či nefunkčnost ovladače.

Pak jsem odinstaloval ze stejné složky přes příslušný soubor. Odinstalace OK, po rebootu chybí i ten původní vadný ovladač, který v Xubuntu byl. Netuším, jak ho vrátit zpátky. Blacklistovaný se zdá, že po odinstalaci driveru rt3290sta není. Ale možná byl nějak tím instalátorem úplně vymazán?
Network manager ukazuje, že pro wifi chybí firmware.

Poradí prosím někdo, jak tu kartu rozběhnout?

Kód: [Vybrat]
dmesg | grep firmwareje bez záznamu.

21
Zkus otestovat ram.

22
Stránky Ubuntu.cz / lubuntu.cz
« kdy: 13 Červen 2017, 17:01:11 »
Ahoj, stará se někdo vůbec o Lubuntu.cz? Screenshoty - žádné tam nejsou, v odkazech na stažení je jen verze 16.04, z odkazu není patrné, jaká konkrétní verze (jestli je to 16.04.2, nebo ne).

23
Bez problému, funguje jak po IPv4 (217.31.202.63) tak IPv6 (2001:1488:ffff::63).

24
Vyřešeno, tyto parametry nic neřeší. Co u mne zabralo, tak odkomentování:

Kód: [Vybrat]
#GRUB_TERMINAL=console
v /etc/default/grub.

Následně:

Kód: [Vybrat]
update-grub
X restartů a drží. Proč?

25
Obecná podpora / Re:Xubuntu 16.04.2 - po rebootu není video
« kdy: 22 Květen 2017, 15:05:19 »
Budu zkoušet různé paratry rebootu v grubu, jako zde nebo zde

Kód: [Vybrat]
GRUB_CMDLINE_LINUX_DEFAULT="quiet nosplash reboot=acpi"
GRUB_CMDLINE_LINUX_DEFAULT="quiet nosplash reboot=pci"
GRUB_CMDLINE_LINUX_DEFAULT="quiet nosplash reboot=warm"
GRUB_CMDLINE_LINUX_DEFAULT="quiet nosplash reboot=cold"
GRUB_CMDLINE_LINUX_DEFAULT="quiet nosplash reboot=triple"
GRUB_CMDLINE_LINUX_DEFAULT="quiet nosplash reboot=kbd"
GRUB_CMDLINE_LINUX_DEFAULT="quiet nosplash reboot=force"

Předpokládám, že módy bios a smp použít nelze, když se jedná o 64 bitový operační systém, mód efi použít nelze, protože nemám nainstalováno jako efi.

Mohu to ještě zkombinovat takto:
GRUB_CMDLINE_LINUX_DEFAULT="quiet nosplash reboot=a,p,w,c,t,k,f"

Stran: [1] 2 3 ... 9