Prosíme přihlašte se nebo zaregistrujte.

Přihlašte se svým uživatelským jménem a heslem.

Autor Téma: problem s kompilaciou.. vyhadzuje error  (Přečteno 2252 krát)

Engi

  • Člen
  • **
  • Příspěvků: 243
    • Zobrazit profil
problem s kompilaciou.. vyhadzuje error
« kdy: 06 Březen 2007, 19:01:25 »
Chcel som si skompilovat window decoration temu. tu je nanu link http://www.kde-look.org/content/show.php?content=51993 ale nie len prenu ale aj pri  roznej inej kompilaci kmi pise totento error
Kód: [Vybrat]
engi@engi-desktop:~/tema$ ./configure --prefix=`kde-config --prefix`
checking build system type... i686-pc-linux
checking host system type... i686-pc-linux
checking target system type... i686-pc-linux
checking for a BSD-compatible install... /usr/bin/install -c
checking for -p flag to install... yes
checking whether build environment is sane... yes
checking for gawk... no
checking for mawk... mawk
checking whether make sets $(MAKE)... yes
checking for style of include used by make... GNU
checking for gcc... gcc
checking for C compiler default output file name... a.out
checking whether the C compiler works... yes
checking whether we are cross compiling... no
checking for suffix of executables...
checking for suffix of object files... o
checking whether we are using the GNU C compiler... yes
checking whether gcc accepts -g... yes
checking for gcc option to accept ISO C89... none needed
checking dependency style of gcc... gcc3
checking how to run the C preprocessor... gcc -E
checking for g++... g++
checking whether we are using the GNU C++ compiler... yes
checking whether g++ accepts -g... yes
checking dependency style of g++... gcc3
checking whether g++ supports -Wundef... yes
checking whether g++ supports -Wno-long-long... yes
checking whether g++ supports -Wnon-virtual-dtor... yes
checking whether g++ supports -fno-exceptions... yes
checking whether g++ supports -fno-check-new... yes
checking whether g++ supports -fno-common... yes
checking whether g++ supports -fexceptions... yes
checking how to run the C++ preprocessor... g++ -E
checking whether g++ supports -O0... yes
not using lib directory suffix
checking for a sed that does not truncate output... /bin/sed
checking for grep that handles long lines and -e... /bin/grep
checking for egrep... /bin/grep -E
checking for ld used by gcc... /usr/bin/ld
checking if the linker (/usr/bin/ld) is GNU ld... yes
checking for /usr/bin/ld option to reload object files... -r
checking for BSD-compatible nm... /usr/bin/nm -B
checking whether ln -s works... yes
checking how to recognise dependent libraries... pass_all
checking for ANSI C header files... yes
checking for sys/types.h... yes
checking for sys/stat.h... yes
checking for stdlib.h... yes
checking for string.h... yes
checking for memory.h... yes
checking for strings.h... yes
checking for inttypes.h... yes
checking for stdint.h... yes
checking for unistd.h... yes
checking dlfcn.h usability... yes
checking dlfcn.h presence... yes
checking for dlfcn.h... yes
checking for g77... no
checking for f77... no
checking for xlf... no
checking for frt... no
checking for pgf77... no
checking for cf77... no
checking for fort77... no
checking for fl32... no
checking for af77... no
checking for f90... no
checking for xlf90... no
checking for pgf90... no
checking for pghpf... no
checking for epcf90... no
checking for gfortran... no
checking for g95... no
checking for f95... no
checking for fort... no
checking for xlf95... no
checking for ifort... no
checking for ifc... no
checking for efc... no
checking for pgf95... no
checking for lf95... no
checking for ftn... no
checking whether we are using the GNU Fortran 77 compiler... no
checking whether  accepts -g... no
checking the maximum length of command line arguments... 32768
checking command to parse /usr/bin/nm -B output from gcc object... ok
checking for objdir... .libs
checking for ar... ar
checking for ranlib... ranlib
checking for strip... strip
checking if gcc static flag  works... yes
checking if gcc supports -fno-rtti -fno-exceptions... no
checking for gcc option to produce PIC... -fPIC
checking if gcc PIC flag -fPIC works... yes
checking if gcc supports -c -o file.o... yes
checking whether the gcc linker (/usr/bin/ld) supports shared libraries... yes
checking whether -lc should be explicitly linked in... no
checking dynamic linker characteristics... GNU/Linux ld.so
checking how to hardcode library paths into programs... immediate
checking whether stripping libraries is possible... yes
checking for shl_load... no
checking for shl_load in -ldld... no
checking for dlopen... no
checking for dlopen in -ldl... yes
checking whether a program can dlopen itself... yes
checking whether a statically linked program can dlopen itself... yes
checking if libtool supports shared libraries... yes
checking whether to build shared libraries... yes
checking whether to build static libraries... no
configure: creating libtool
appending configuration tag "CXX" to libtool
checking for ld used by g++... /usr/bin/ld
checking if the linker (/usr/bin/ld) is GNU ld... yes
checking whether the g++ linker (/usr/bin/ld) supports shared libraries... yes
checking for g++ option to produce PIC... -fPIC
checking if g++ PIC flag -fPIC works... yes
checking if g++ supports -c -o file.o... yes
checking whether the g++ linker (/usr/bin/ld) supports shared libraries... yes
checking dynamic linker characteristics... GNU/Linux ld.so
checking how to hardcode library paths into programs... immediate
checking whether stripping libraries is possible... yes
checking for shl_load... (cached) no
checking for shl_load in -ldld... (cached) no
checking for dlopen... (cached) no
checking for dlopen in -ldl... (cached) yes
checking whether a program can dlopen itself... (cached) yes
checking whether a statically linked program can dlopen itself... (cached) yes
appending configuration tag "F77" to libtool
checking for msgfmt... /usr/bin/msgfmt
checking for gmsgfmt... /usr/bin/msgfmt
checking for xgettext... /usr/bin/xgettext
checking if C++ programs can be compiled... yes
checking for strlcat... no
checking if strlcat needs custom prototype... yes - in libkdefakes
checking for strlcpy... no
checking if strlcpy needs custom prototype... yes - in libkdefakes
checking for main in -lutil... yes
checking for main in -lcompat... no
checking for crypt in -lcrypt... yes
checking for socklen_t... socklen_t
checking for dnet_ntoa in -ldnet... no
checking for dnet_ntoa in -ldnet_stub... no
checking for inet_ntoa... yes
checking for connect... yes
checking for remove... yes
checking for shmat... yes
checking for sys/types.h... (cached) yes
checking for stdint.h... (cached) yes
checking for poll in -lpoll... no
checking CoreAudio/CoreAudio.h usability... no
checking CoreAudio/CoreAudio.h presence... no
checking for CoreAudio/CoreAudio.h... no
checking if res_init needs -lresolv... yes
checking if res_init is available... yes
checking for killpg in -lucb... no
checking for int... yes
checking size of int... 4
checking for short... yes
checking size of short... 2
checking for long... yes
checking size of long... 4
checking for char *... yes
checking size of char *... 4
checking for dlopen in -ldl... (cached) yes
checking for shl_unload in -ldld... no
checking for size_t... yes
checking size of size_t... 4
checking for unsigned long... yes
checking size of unsigned long... 4
checking sizeof size_t == sizeof unsigned long... yes
checking crt_externs.h usability... no
checking crt_externs.h presence... no
checking for crt_externs.h... no
checking for _NSGetEnviron... no
checking for vsnprintf... yes
checking for snprintf... yes
checking for X... configure: error: Can't find X libraries. Please check your installation and add the correct paths!
lebo potom mi nic nejde co chcem kompilovat
fakt neviem co stym a s kompiklaciou nemam dake skusenosti tak mno. Fakt netusim co pomne ziada neviete pomoct?
Intel Pentium 4 1700 Hz 640 DDR Nvidia GeForce FX 5200 128 RAM
OS: Kubuntu 6.10 + moje nesikovne ruky ktore ho casto d****u :D ... kazdy sa raz uci :D

LS

  • Závislák
  • ****
  • Příspěvků: 3849
    • Zobrazit profil
    • http://linux.euweb.cz
problem s kompilaciou.. vyhadzuje error
« Odpověď #1 kdy: 06 Březen 2007, 19:21:41 »

Engi

  • Člen
  • **
  • Příspěvků: 243
    • Zobrazit profil
problem s kompilaciou.. vyhadzuje error
« Odpověď #2 kdy: 06 Březen 2007, 19:51:12 »
tak to mi pomohlo ale ako nahle dam make tak mi zase hadze error
Kód: [Vybrat]
engi@engi-desktop:~/theme/cylonminimal-0.1$ make
cd . && /bin/sh /home/engi/theme/cylonminimal-0.1/admin/missing --run autoheader
/home/engi/theme/cylonminimal-0.1/admin/missing: line 52: autoheader: príkaz nenájdený
WARNING: `autoheader' is missing on your system.  You should only need it if
         you modified `acconfig.h' or `configure.in'.  You might want
         to install the `Autoconf' and `GNU m4' packages.  Grab them
         from any GNU archive site.
rm -f stamp-h1
touch config.h.in
cd . && /bin/sh ./config.status config.h
config.status: creating config.h
config.status: config.h is unchanged
make  all-recursive
make[1]: Entering directory `/home/engi/theme/cylonminimal-0.1'
Making all in kwin
make[2]: Entering directory `/home/engi/theme/cylonminimal-0.1/kwin'
Making all in .
make[3]: Entering directory `/home/engi/theme/cylonminimal-0.1/kwin'
/usr/share/qt3/bin/moc ./cylonminimal.h -o cylonminimal.moc
if /bin/sh ../libtool --silent --mode=compile g++ -DHAVE_CONFIG_H -I. -I. -I.. -I./../../lib -I/usr/include/kde -I/usr/share/qt3/include -I.   -DQT_THREAD_SUPPORT  -D_REENTRANT  -Wnon-virtual-dtor -Wno-long-long -Wundef -Wall -W -Wpointer-arith -Wwrite-strings -O2 -fno-exceptions -fno-check-new -fno-common -MT cylonminimal.lo -MD -MP -MF ".deps/cylonminimal.Tpo" -c -o cylonminimal.lo cylonminimal.cpp; \
        then mv -f ".deps/cylonminimal.Tpo" ".deps/cylonminimal.Plo"; else rm -f ".deps/cylonminimal.Tpo"; exit 1; fi
In file included from cylonminimal.cpp:43:
cylonminimal.h:49:25: error: kdecoration.h: No such file or directory
cylonminimal.h:50:32: error: kdecorationfactory.h: No such file or directory
cylonminimal.h:130: warning: non-local variable 'Cylonminimal:: Cylonminimal::Settings_Param' uses anonymous type
cylonminimal.h:141: error: expected class-name before '{' token
cylonminimal.h:146: error: 'BorderSize' was not declared in this scope
cylonminimal.h:146: error: template argument 1 is invalid
cylonminimal.h:148: error: ISO C++ forbids declaration of 'KDecoration' with no type
cylonminimal.h:148: error: 'KDecoration' declared as a 'virtual' field
cylonminimal.h:148: error: expected ';' before '*' token
cylonminimal.h:141: warning: 'class Cylonminimal::CylonminimalHandler' has virtual functions but non-virtual destructor
cylonminimal.h:293: error: expected class-name before '{' token
cylonminimal.h:298: error: expected `)' before '*' token
cylonminimal.h:312: error: 'Position' does not name a type
cylonminimal.h:293: warning: 'class Cylonminimal::CylonminimalClient' has virtual functions but non-virtual destructor
cylonminimal.h: In member function 'int Cylonminimal::CylonminimalClient::width() const':
cylonminimal.h:344: error: 'widget' was not declared in this scope
cylonminimal.h: In member function 'int Cylonminimal::CylonminimalClient::height() const':
cylonminimal.h:348: error: 'widget' was not declared in this scope
cylonminimal.h: In member function 'bool Cylonminimal::CylonminimalClient::maximizedVertical() const':
cylonminimal.h:352: error: 'maximizeMode' was not declared in this scope
cylonminimal.h:352: error: 'MaximizeVertical' was not declared in this scope
cylonminimal.moc: In static member function 'static QMetaObject* Cylonminimal::CylonminimalClient::staticMetaObject()':
cylonminimal.moc:54: error: 'KDecoration' has not been declared
cylonminimal.moc: In member function 'virtual void* Cylonminimal::CylonminimalClient::qt_cast(const char*)':
cylonminimal.moc:78: error: 'KDecoration' has not been declared
cylonminimal.moc: In member function 'virtual bool Cylonminimal::CylonminimalClient::qt_invoke(int, QUObject*)':
cylonminimal.moc:87: error: 'KDecoration' has not been declared
cylonminimal.moc: In member function 'virtual bool Cylonminimal::CylonminimalClient::qt_emit(int, QUObject*)':
cylonminimal.moc:94: error: 'KDecoration' has not been declared
cylonminimal.moc: In member function 'virtual bool Cylonminimal::CylonminimalClient::qt_property(int, int, QVariant*)':
cylonminimal.moc:100: error: 'KDecoration' has not been declared
cylonminimal.cpp: In member function 'void Cylonminimal::CylonminimalHandler::createPixmaps(bool)':
cylonminimal.cpp:97: error: 'options' was not declared in this scope
cylonminimal.cpp:98: error: 'BorderLarge' was not declared in this scope
cylonminimal.cpp:102: error: 'BorderVeryLarge' was not declared in this scope
cylonminimal.cpp:106: error: 'BorderTiny' was not declared in this scope
cylonminimal.cpp:107: error: 'BorderNormal' was not declared in this scope
cylonminimal.cpp:113: error: 'options' was not declared in this scope
cylonminimal.cpp:121: error: 'KDecoration' has not been declared
cylonminimal.cpp:121: error: 'ColorTitleBar' was not declared in this scope
cylonminimal.cpp:122: error: 'KDecoration' has not been declared
cylonminimal.cpp:122: error: 'ColorTitleBlend' was not declared in this scope
cylonminimal.cpp:149: error: 'KDecoration' has not been declared
cylonminimal.cpp:150: error: 'KDecoration' has not been declared
cylonminimal.cpp: In member function 'QPixmap* Cylonminimal::CylonminimalHandler::loadPixmap(const QString&, bool)':
cylonminimal.cpp:603: error: 'KDecoration' has not been declared
cylonminimal.cpp:603: error: 'ColorTitleBar' was not declared in this scope
cylonminimal.cpp:604: error: 'KDecoration' has not been declared
cylonminimal.cpp:604: error: 'ColorTitleBlend' was not declared in this scope
cylonminimal.cpp:605: error: 'KDecoration' has not been declared
cylonminimal.cpp:606: error: 'KDecoration' has not been declared
cylonminimal.cpp:604: warning: unused variable 'activeBlendColor'
cylonminimal.cpp:606: warning: unused variable 'inactiveBlendColor'
cylonminimal.cpp: In member function 'virtual bool Cylonminimal::CylonminimalHandler::reset(long unsigned int)':
cylonminimal.cpp:631: error: 'SettingBorder' was not declared in this scope
cylonminimal.cpp:635: error: 'SettingFont' was not declared in this scope
cylonminimal.cpp:640: error: 'SettingColors' was not declared in this scope
cylonminimal.cpp:645: error: 'SettingButtons' was not declared in this scope
cylonminimal.cpp:649: error: 'SettingTooltips' was not declared in this scope
cylonminimal.cpp:669: error: 'resetDecorations' was not declared in this scope
cylonminimal.cpp: At global scope:
cylonminimal.cpp:741: error: expected constructor, destructor, or type conversion before '*' token
cylonminimal.cpp:746: error: 'BorderSize' is not a member of 'Cylonminimal::CylonminimalHandler'
cylonminimal.cpp:746: error: 'BorderSize' is not a member of 'Cylonminimal::CylonminimalHandler'
cylonminimal.cpp:746: error: template argument 1 is invalid
cylonminimal.cpp: In member function 'virtual int Cylonminimal::CylonminimalHandler::borderSizes() const':
cylonminimal.cpp:749: error: 'BorderSize' was not declared in this scope
cylonminimal.cpp:749: error: template argument 1 is invalid
cylonminimal.cpp:749: error: 'BorderNormal' was not declared in this scope
cylonminimal.cpp:749: error: 'BorderLarge' was not declared in this scope
cylonminimal.cpp:749: error: 'BorderVeryLarge' was not declared in this scope
cylonminimal.cpp: In constructor 'Cylonminimal::CylonminimalButton::CylonminimalButton(Cylonminimal::CylonminimalClient*, const char*, Cylonminimal::Button, const QString&, bool, int)':
cylonminimal.cpp:753: error: 'class Cylonminimal::CylonminimalClient' has no member named 'widget'
cylonminimal.cpp:768: error: 'class Cylonminimal::CylonminimalClient' has no member named 'isActive'
cylonminimal.cpp:769: error: 'class Cylonminimal::CylonminimalClient' has no member named 'isActive'
cylonminimal.cpp: At global scope:
cylonminimal.cpp:753: warning: unused parameter 'bttstate'
cylonminimal.cpp: In member function 'virtual void Cylonminimal::CylonminimalButton::drawButton(QPainter*)':
cylonminimal.cpp:820: error: 'class Cylonminimal::CylonminimalClient' has no member named 'isActive'
cylonminimal.cpp:822: error: 'class Cylonminimal::CylonminimalClient' has no member named 'isActive'
cylonminimal.cpp:876: error: 'class Cylonminimal::CylonminimalClient' has no member named 'isActive'
cylonminimal.cpp:880: error: 'class Cylonminimal::CylonminimalClient' has no member named 'isActive'
cylonminimal.cpp:884: error: 'class Cylonminimal::CylonminimalClient' has no member named 'maximizeMode'
cylonminimal.cpp:885: error: 'MaximizeFull' is not a member of 'Cylonminimal::CylonminimalClient'
cylonminimal.cpp:888: error: 'class Cylonminimal::CylonminimalClient' has no member named 'isActive'
cylonminimal.cpp:892: error: 'class Cylonminimal::CylonminimalClient' has no member named 'isActive'
cylonminimal.cpp: At global scope:
cylonminimal.cpp:999: error: expected `)' before '*' token
cylonminimal.cpp: In member function 'virtual void Cylonminimal::CylonminimalClient::init()':
cylonminimal.cpp:1021: error: 'WStaticContents' was not declared in this scope
cylonminimal.cpp:1021: error: 'WNoAutoErase' was not declared in this scope
cylonminimal.cpp:1021: error: 'createMainWidget' was not declared in this scope
cylonminimal.cpp:1022: error: 'widget' was not declared in this scope
cylonminimal.cpp: In member function 'void Cylonminimal::CylonminimalClient::createLayout()':
cylonminimal.cpp:1049: error: 'widget' was not declared in this scope
cylonminimal.cpp:1064: error: 'isActive' was not declared in this scope
cylonminimal.cpp:1092: error: 'options' was not declared in this scope
cylonminimal.cpp:1137: error: 'isPreview' was not declared in this scope
cylonminimal.cpp: In member function 'virtual void Cylonminimal::CylonminimalClient::reset(long unsigned int)':
cylonminimal.cpp:1158: error: 'widget' was not declared in this scope
cylonminimal.cpp: In member function 'void Cylonminimal::CylonminimalClient::addButtons(QBoxLayout*, const QString&)':
cylonminimal.cpp:1203: error: 'LeftButton' was not declared in this scope
cylonminimal.cpp:1203: error: 'MidButton' was not declared in this scope
cylonminimal.cpp:1203: error: 'RightButton' was not declared in this scope
cylonminimal.cpp:1209: error: 'isMinimizable' was not declared in this scope
cylonminimal.cpp:1213: error: 'connect' was not declared in this scope
cylonminimal.cpp:1228: error: 'isMaximizable' was not declared in this scope
cylonminimal.cpp:1232: error: 'connect' was not declared in this scope
cylonminimal.cpp:1247: error: 'isCloseable' was not declared in this scope
cylonminimal.cpp:1251: error: 'connect' was not declared in this scope
cylonminimal.cpp: In member function 'void Cylonminimal::CylonminimalClient::updateMask()':
cylonminimal.cpp:1349: error: 'setMask' was not declared in this scope
cylonminimal.cpp: In member function 'virtual void Cylonminimal::CylonminimalClient::captionChange()':
cylonminimal.cpp:1357: error: 'widget' was not declared in this scope
cylonminimal.cpp:1357: error: 'isActive' was not declared in this scope
cylonminimal.cpp: In member function 'void Cylonminimal::CylonminimalClient::iconChange()':
cylonminimal.cpp:1403: error: 'widget' was not declared in this scope
cylonminimal.cpp:1403: error: 'isActive' was not declared in this scope
cylonminimal.cpp: In member function 'void Cylonminimal::CylonminimalClient::drawAppIcon(QPainter&)':
cylonminimal.cpp:1417: error: 'isActive' was not declared in this scope
cylonminimal.cpp:1419: error: 'class Cylonminimal::CylonminimalClient' has no member named 'icon'
cylonminimal.cpp:1419: error: incomplete type 'QIconSet' used in nested name specifier
cylonminimal.cpp:1419: error: incomplete type 'QIconSet' used in nested name specifier
cylonminimal.cpp:1423: error: 'class Cylonminimal::CylonminimalClient' has no member named 'icon'
cylonminimal.cpp:1423: error: incomplete type 'QIconSet' used in nested name specifier
cylonminimal.cpp:1423: error: incomplete type 'QIconSet' used in nested name specifier
cylonminimal.cpp:1458: error: 'isActive' was not declared in this scope
cylonminimal.cpp: In member function 'void Cylonminimal::CylonminimalClient::drawCaptionText(QPainter&)':
cylonminimal.cpp:1474: error: 'class Cylonminimal::CylonminimalHandler' has no member named 'options'
cylonminimal.cpp:1474: error: 'isActive' was not declared in this scope
cylonminimal.cpp:1478: error: 'AlignLeft' was not declared in this scope
cylonminimal.cpp:1478: error: 'AlignVCenter' was not declared in this scope
cylonminimal.cpp:1478: error: 'SingleLine' was not declared in this scope
cylonminimal.cpp:1481: error: 'AlignCenter' was not declared in this scope
cylonminimal.cpp:1484: error: 'AlignRight' was not declared in this scope
cylonminimal.cpp:1508: error: 'caption' was not declared in this scope
cylonminimal.cpp:1524: error: 'options' was not declared in this scope
cylonminimal.cpp:1524: error: 'ColorFont' was not declared in this scope
cylonminimal.cpp:1529: error: 'caption' was not declared in this scope
cylonminimal.cpp: In member function 'void Cylonminimal::CylonminimalClient::drawTitlebar(QPainter&, QRect&)':
cylonminimal.cpp:1543: error: 'isActive' was not declared in this scope
cylonminimal.cpp:1572: error: 'isActive' was not declared in this scope
cylonminimal.cpp: In member function 'void Cylonminimal::CylonminimalClient::drawFrame(QPainter&, QRect&, QPaintEvent*)':
cylonminimal.cpp:1606: error: 'isActive' was not declared in this scope
cylonminimal.cpp: In member function 'int Cylonminimal::CylonminimalClient::BttWidthOnLeft()':
cylonminimal.cpp:1697: error: 'options' was not declared in this scope
cylonminimal.cpp:1738: error: 'isMinimizable' was not declared in this scope
cylonminimal.cpp:1740: error: 'isActive' was not declared in this scope
cylonminimal.cpp:1742: error: 'isMaximizable' was not declared in this scope
cylonminimal.cpp:1744: error: 'isActive' was not declared in this scope
cylonminimal.cpp:1746: error: 'isCloseable' was not declared in this scope
cylonminimal.cpp:1748: error: 'isActive' was not declared in this scope
cylonminimal.cpp:1751: error: 'providesContextHelp' was not declared in this scope
cylonminimal.cpp:1753: error: 'isActive' was not declared in this scope
cylonminimal.cpp:1777: error: 'isActive' was not declared in this scope
cylonminimal.cpp: In member function 'int Cylonminimal::CylonminimalClient::BttWidthOnRight()':
cylonminimal.cpp:1785: error: 'options' was not declared in this scope
cylonminimal.cpp:1826: error: 'isMinimizable' was not declared in this scope
cylonminimal.cpp:1828: error: 'isActive' was not declared in this scope
cylonminimal.cpp:1831: error: 'isMaximizable' was not declared in this scope
cylonminimal.cpp:1833: error: 'isActive' was not declared in this scope
cylonminimal.cpp:1836: error: 'isCloseable' was not declared in this scope
cylonminimal.cpp:1838: error: 'isActive' was not declared in this scope
cylonminimal.cpp:1841: error: 'providesContextHelp' was not declared in this scope
cylonminimal.cpp:1843: error: 'isActive' was not declared in this scope
cylonminimal.cpp:1873: error: 'isActive' was not declared in this scope
cylonminimal.cpp: In member function 'virtual void Cylonminimal::CylonminimalClient::activeChange()':
cylonminimal.cpp:1886: error: 'widget' was not declared in this scope
cylonminimal.cpp: In member function 'virtual void Cylonminimal::CylonminimalClient::maximizeChange()':
cylonminimal.cpp:1904: error: 'maximizeMode' was not declared in this scope
cylonminimal.cpp:1904: error: 'MaximizeFull' was not declared in this scope
cylonminimal.cpp:1907: error: 'widget' was not declared in this scope
cylonminimal.cpp: In member function 'void Cylonminimal::CylonminimalClient::slotMaximize()':
cylonminimal.cpp:1940: error: 'MidButton' was not declared in this scope
cylonminimal.cpp:1941: error: 'maximizeMode' was not declared in this scope
cylonminimal.cpp:1941: error: 'MaximizeVertical' was not declared in this scope
cylonminimal.cpp:1941: error: 'maximize' was not declared in this scope
cylonminimal.cpp:1944: error: 'RightButton' was not declared in this scope
cylonminimal.cpp:1945: error: 'MaximizeHorizontal' was not declared in this scope
cylonminimal.cpp:1948: error: 'LeftButton' was not declared in this scope
cylonminimal.cpp:1949: error: 'MaximizeFull' was not declared in this scope
cylonminimal.cpp:1949: error: 'MaximizeRestore' was not declared in this scope
cylonminimal.cpp: In member function 'void Cylonminimal::CylonminimalClient::paintEvent(QPaintEvent*)':
cylonminimal.cpp:1988: error: 'widget' was not declared in this scope
cylonminimal.cpp: In member function 'void Cylonminimal::CylonminimalClient::resizeEvent(QResizeEvent*)':
cylonminimal.cpp:2007: error: 'widget' was not declared in this scope
cylonminimal.cpp:2032: error: no matching function for call to 'QApplication::postEvent(Cylonminimal::CylonminimalClient* const, QPaintEvent*)'
/usr/share/qt3/include/qapplication.h:154: note: candidates are: static void QApplication::postEvent(QObject*, QEvent*)
cylonminimal.cpp: In member function 'void Cylonminimal::CylonminimalClient::mouseDoubleClickEvent(QMouseEvent*)':
cylonminimal.cpp:2040: error: 'titlebarDblClickOperation' was not declared in this scope
cylonminimal.cpp: In member function 'void Cylonminimal::CylonminimalClient::wheelEvent(QWheelEvent*)':
cylonminimal.cpp:2045: error: 'titlebarMouseWheelOperation' was not declared in this scope
cylonminimal.cpp: At global scope:
cylonminimal.cpp:2048: error: 'Position' in class 'Cylonminimal::CylonminimalClient' does not name a type
cylonminimal.cpp: In member function 'virtual void Cylonminimal::CylonminimalClient::resize(const QSize&)':
cylonminimal.cpp:2125: error: 'widget' was not declared in this scope
cylonminimal.cpp: In member function 'virtual void Cylonminimal::CylonminimalClient::borders(int&, int&, int&, int&) const':
cylonminimal.cpp:2133: error: 'isActive' was not declared in this scope
cylonminimal.cpp:2141: error: 'maximizeMode' was not declared in this scope
cylonminimal.cpp:2141: error: 'MaximizeHorizontal' was not declared in this scope
cylonminimal.cpp:2141: error: 'options' was not declared in this scope
cylonminimal.cpp:2143: error: 'maximizeMode' was not declared in this scope
cylonminimal.cpp:2143: error: 'MaximizeVertical' was not declared in this scope
cylonminimal.cpp:2145: error: 'options' was not declared in this scope
cylonminimal.cpp: In member function 'virtual QSize Cylonminimal::CylonminimalClient::minimumSize() const':
cylonminimal.cpp:2152: error: 'widget' was not declared in this scope
cylonminimal.cpp: In member function 'virtual bool Cylonminimal::CylonminimalClient::eventFilter(QObject*, QEvent*)':
cylonminimal.cpp:2157: error: 'widget' was not declared in this scope
cylonminimal.cpp:2178: error: 'processMousePressEvent' was not declared in this scope
cylonminimal.cpp: At global scope:
cylonminimal.cpp:2189: error: expected constructor, destructor, or type conversion before '*' token
make[3]: *** [cylonminimal.lo] Chyba 1
make[3]: Leaving directory `/home/engi/theme/cylonminimal-0.1/kwin'
make[2]: *** [all-recursive] Chyba 1
make[2]: Leaving directory `/home/engi/theme/cylonminimal-0.1/kwin'
make[1]: *** [all-recursive] Chyba 1
make[1]: Leaving directory `/home/engi/theme/cylonminimal-0.1'
make: *** [all] Chyba 2
Intel Pentium 4 1700 Hz 640 DDR Nvidia GeForce FX 5200 128 RAM
OS: Kubuntu 6.10 + moje nesikovne ruky ktore ho casto d****u :D ... kazdy sa raz uci :D

Petr Merlin Vaněček

  • Moderátor
  • Guru
  • ***
  • Příspěvků: 5039
    • Zobrazit profil
    • Lomítkáři
Registered Linux user #421281
Stiskni CTRL + W ...
80% mozku tvoří kapalina ... u některých brzdová

Martin - ViPEr*CZ*

problem s kompilaciou.. vyhadzuje error
« Odpověď #4 kdy: 08 Březen 2007, 10:55:11 »
checking for X... configure: error: Can't find X libraries. Please check your installation and add the correct paths!

// tahle hláška mluví za vše...
Open source is gold way... Mint 17.2, Debian 8.1 Jessie| Ubuntu Wiki (návody) | Google vyhledávač | Qt4 návody

Petr Merlin Vaněček

  • Moderátor
  • Guru
  • ***
  • Příspěvků: 5039
    • Zobrazit profil
    • Lomítkáři
problem s kompilaciou.. vyhadzuje error
« Odpověď #5 kdy: 08 Březen 2007, 14:24:37 »
ViPEr*CZ*: soude dle nasledujiciho vypisu Engi uz tuto chybu opravil, chybi mu ale dalsi a dalsi knihovny
Registered Linux user #421281
Stiskni CTRL + W ...
80% mozku tvoří kapalina ... u některých brzdová

LS

  • Závislák
  • ****
  • Příspěvků: 3849
    • Zobrazit profil
    • http://linux.euweb.cz
problem s kompilaciou.. vyhadzuje error
« Odpověď #6 kdy: 08 Březen 2007, 14:57:48 »
zakladni vyvojarske balicky pro KDE nainstalujete prikazem

sudo apt-get install kde-devel

Engi

  • Člen
  • **
  • Příspěvků: 243
    • Zobrazit profil
problem s kompilaciou.. vyhadzuje error
« Odpověď #7 kdy: 09 Březen 2007, 17:26:20 »
Dajkujem prave to stahujem dufam ze to pojde. Kedze sa v kompilaci len ucim a tieto hlasky  a ked mi napise checking for X... configure: error: Can't find X libraries. Please check your installation and add the correct paths! ... tak neviem aky balicek mam nainstalovat ... ale tu uplne staci google ;) nevadi kazdy sa uci :P
Intel Pentium 4 1700 Hz 640 DDR Nvidia GeForce FX 5200 128 RAM
OS: Kubuntu 6.10 + moje nesikovne ruky ktore ho casto d****u :D ... kazdy sa raz uci :D